program: Orca
programVersion: 5.0.2
elementType: S P O O O O O N N N C C C C C C C C C C C C C C H H H H H H H H H H H H H H H H H H H H
charge: 0
multiplicity: 1
keywords: wb97x-d3
keywords: def2-TZVPP
keywords: def2/J RIJCOSX
keywords: DEFGRID2
keywords: scfconv7
keywords: smallprint printgap noloewdin
keywords: NOSOSCF
formula: C14H20N3O5PS
InChI: InChI=1/C14H20N3O5PS/c1-5-19-14(18)11-9-17-12(15-10(11)4)8-13(16-17)22-23(24,20-6-2)21-7-3/h8-9H,5-7H2,1-4H3
44 atoms
S  2.553443 1.863302 1.583611
P  3.051305 0.274936 0.637951
O  2.190071 -1.075438 0.98839
O  4.449139 -0.391029 0.983206
O  3.051196 0.329245 -0.949848
O  -4.146225 0.984716 -1.672669
O  -5.64899 -0.390883 -0.759554
N  -1.041966 -0.758318 0.078254
N  -2.36263 -2.542421 0.897566
N  0.213304 -0.298933 0.060112
C  -1.172892 -1.942211 0.783951
C  -3.327387 -0.748019 -0.360648
C  -2.094832 -0.162056 -0.483351
C  -3.418453 -1.991579 0.356013
C  0.874031 -1.191211 0.766042
C  0.090206 -2.244764 1.250239
C  -4.698882 -2.741795 0.52369
C  -4.502922 -0.056804 -0.936464
C  5.608613 0.377962 1.361111
C  2.365806 1.323935 -1.740121
C  -5.168815 1.833221 -2.221161
C  6.25271 1.072267 0.187125
C  3.325023 2.384935 -2.215708
C  -5.668794 2.837538 -1.209361
H  -1.898887 0.76767 -0.997443
H  0.395611 -3.08856 1.845059
H  -5.419008 -2.181093 1.119039
H  -5.170916 -2.957702 -0.434391
H  -4.492663 -3.682366 1.029438
H  6.287382 -0.350252 1.801903
H  5.331701 1.092085 2.139228
H  1.54868 1.76323 -1.168989
H  1.931155 0.778688 -2.577154
H  -4.681296 2.337554 -3.053888
H  -5.982714 1.230943 -2.626444
H  6.487651 0.372495 -0.615101
H  7.18704 1.527343 0.518203
H  5.627139 1.869134 -0.21576
H  2.795549 3.069404 -2.880003
H  4.158081 1.957916 -2.77459
H  3.720721 2.969189 -1.384655
H  -6.364626 3.518848 -1.700619
H  -6.198089 2.365681 -0.381929
H  -4.8509 3.4345 -0.804717
elementType: S P O N C H
totalener: -1825.71216208 hartree
nucrepener: 2476.22451602 hartree
electener: -4301.93667811 hartree
oneelecener: -7429.10971905 hartree
twoeener: 3127.17304094 hartree
cpcmener: -0.02815343 hartree
kineticenergy: 1819.71313805 hartree
xcener: -138.291534209230 hartree
chargesum: -0.0000000
charge: -0.436491 0.739550 -0.315451 -0.337722 -0.335734 -0.289379 -0.456578 0.173132 -0.347127 -0.415043 0.208694 -0.141049 0.076325 0.192584 0.340059 -0.327233 -0.250774 0.482279 0.032188 0.069063 0.039721 -0.247177 -0.261941 -0.253423 0.160867 0.166999 0.104460 0.104755 0.096021 0.108875 0.093803 0.088493 0.107219 0.106704 0.091535 0.093395 0.101267 0.083395 0.103161 0.094844 0.080181 0.096304 0.090709 0.088540
qa: -0.4365 0.7396 -0.3155 -0.3377 -0.3357 -0.2894 -0.4566 0.1731 -0.3471 -0.4150 0.2087 -0.1410 0.0763 0.1926 0.3401 -0.3272 -0.2508 0.4823 0.0322 0.0691 0.0397 -0.2472 -0.2619 -0.2534 0.1609 0.1670 0.1045 0.1048 0.0960 0.1089 0.0938 0.0885 0.1072 0.1067 0.0915 0.0934 0.1013 0.0834 0.1032 0.0948 0.0802 0.0963 0.0907 0.0885
va: 1.9874 5.5081 2.1965 2.1239 2.0829 2.1255 2.0506 3.4346 3.1302 2.8017 4.0286 3.7490 4.0272 3.8649 4.0528 3.8859 3.9162 4.1253 3.8571 3.7974 3.8410 3.8998 3.9460 3.9223 1.0227 0.9999 1.0054 1.0035 1.0219 0.9919 1.0118 1.0164 0.9942 0.9957 1.0106 1.0060 1.0098 1.0046 1.0109 1.0011 1.0084 1.0068 1.0114 1.0044
dispcorr: -0.020380882 hartree
energy: -1825.732542967253
dipole: -2.04160 2.22093 0.17933 14.89722 -13.60462 1.29260 -13.07127 11.18582 -1.88545
magnitude: 2.29301 au
magnitude: 5.82837 debye
