program: Orca
programVersion: 5.0.2
elementType: S P O O O O O N N N C C C C C C C C C C C C C C H H H H H H H H H H H H H H H H H H H H
charge: 0
multiplicity: 1
keywords: wb97x-d3
keywords: def2-TZVPP
keywords: def2/J RIJCOSX
keywords: DEFGRID2
keywords: scfconv7
keywords: smallprint printgap noloewdin
keywords: NOSOSCF
formula: C14H20N3O5PS
InChI: InChI=1/C14H20N3O5PS/c1-5-19-14(18)11-9-17-12(15-10(11)4)8-13(16-17)22-23(24,20-6-2)21-7-3/h8-9H,5-7H2,1-4H3
44 atoms
S  2.775002 2.27274 0.713269
P  3.217413 0.474268 0.224993
O  2.351619 -0.716182 0.939295
O  4.673662 -0.034293 0.6047
O  3.093371 0.038181 -1.293088
O  -4.134143 0.646964 -1.829993
O  -5.572673 -0.478134 -0.546562
N  -0.933442 -0.579768 0.175165
N  -2.186945 -2.144427 1.432945
N  0.313258 -0.13629 -0.013338
C  -1.013203 -1.580348 1.12874
C  -3.233323 -0.69459 -0.160216
C  -2.018706 -0.137682 -0.46315
C  -3.273854 -1.738331 0.828945
C  1.021457 -0.857662 0.828346
C  0.276758 -1.775643 1.577653
C  -4.53382 -2.435303 1.226021
C  -4.441388 -0.182558 -0.844517
C  5.40929 0.451294 1.745708
C  3.2446 0.959257 -2.395279
C  -5.197951 1.289185 -2.553866
C  4.853988 -0.047906 3.056605
C  1.900244 1.340111 -2.958681
C  -5.745746 2.489527 -1.818058
H  -1.860001 0.650066 -1.185163
H  0.624077 -2.471406 2.322173
H  -4.290706 -3.228434 1.929399
H  -5.237724 -1.754452 1.704026
H  -5.041712 -2.874884 0.368176
H  5.434551 1.542366 1.719019
H  6.424058 0.088338 1.590236
H  3.848462 0.432506 -3.133369
H  3.802363 1.843091 -2.080142
H  -4.738022 1.593072 -3.492824
H  -5.983009 0.568049 -2.785301
H  3.866685 0.363111 3.270179
H  5.519094 0.268239 3.861317
H  4.794572 -1.136167 3.08186
H  2.049803 1.973136 -3.834473
H  1.305987 1.900342 -2.237563
H  1.334221 0.462897 -3.273404
H  -6.236357 2.218639 -0.883788
H  -4.961702 3.216187 -1.60227
H  -6.487242 2.980499 -2.450046
elementType: S P O N C H
totalener: -1825.71253721 hartree
nucrepener: 2483.26066775 hartree
electener: -4308.97320496 hartree
oneelecener: -7443.53487308 hartree
twoeener: 3134.56166813 hartree
cpcmener: -0.02853883 hartree
kineticenergy: 1819.71208217 hartree
xcener: -138.289880009273 hartree
chargesum: 0.0000000
charge: -0.438710 0.760571 -0.312494 -0.343002 -0.340290 -0.288732 -0.457594 0.180798 -0.346597 -0.408477 0.206226 -0.140290 0.076768 0.193057 0.336074 -0.325089 -0.252099 0.482755 0.027221 0.044236 0.040137 -0.238552 -0.240386 -0.253864 0.161102 0.166136 0.095651 0.104355 0.104267 0.094524 0.108359 0.106886 0.088134 0.108162 0.090478 0.080706 0.098451 0.091152 0.101358 0.074561 0.088784 0.091452 0.088137 0.095679
qa: -0.4387 0.7606 -0.3125 -0.3430 -0.3403 -0.2887 -0.4576 0.1808 -0.3466 -0.4085 0.2062 -0.1403 0.0768 0.1931 0.3361 -0.3251 -0.2521 0.4828 0.0272 0.0442 0.0401 -0.2386 -0.2404 -0.2539 0.1611 0.1661 0.0957 0.1044 0.1043 0.0945 0.1084 0.1069 0.0881 0.1082 0.0905 0.0807 0.0985 0.0912 0.1014 0.0746 0.0888 0.0915 0.0881 0.0957
va: 1.9822 5.4823 2.1814 2.1232 2.1127 2.1274 2.0486 3.4091 3.1294 2.7923 4.0306 3.7553 4.0296 3.8634 4.0556 3.8881 3.9169 4.1223 3.8646 3.8562 3.8398 3.8861 3.9057 3.9204 1.0217 1.0002 1.0220 1.0052 1.0036 1.0101 0.9919 0.9961 1.0107 0.9957 1.0106 1.0182 1.0088 1.0064 1.0106 1.0186 1.0057 1.0122 1.0045 1.0068
dispcorr: -0.020076262 hartree
energy: -1825.732613467896
dipole: -8.28530 8.50631 0.22101 6.99166 -6.43226 0.55940 -6.98227 5.58906 -1.39322
magnitude: 1.51751 au
magnitude: 3.85720 debye
