program: Gaussian 09
title: 000065931
version: EM64L-G09RevD.01
frameworkgroup: C1[X(C11H14N4O2S2)]
method: RPBEPBE
basis: SDD
operation: Freq
keyword: #p
keyword: freq=noraman
keyword: PBEPBE/SDD
title: #p freq=noraman PBEPBE/SDD
converged: YES YES NO NO
title: Mulliken charges:
elementType: S S O O N N N N C C C C C C C C C C C H H H H H H H H H H H H H H
charge: 0.247174 0.252127 -0.284803 -0.266840 -0.144345 -0.148675 -0.225375 -0.093876 -0.317668 -0.779388 0.143837 0.074271 -0.624210 -0.621217 0.192214 -0.196038 0.209930 -0.610586 -0.601734 0.241602 0.279549 0.373820 0.265220 0.275325 0.284068 0.266703 0.270462 0.270494 0.248808 0.248025 0.268216 0.251528 0.251383
chargesum: 0.00000
title: Mulliken charges with hydrogens summed into heavy atoms:
elementType: S S O O N N N N C C C C C C C C C C C
charge: 0.247174 0.252127 -0.284803 -0.266840 -0.144345 -0.148675 -0.225375 -0.093876 0.203483 -0.405569 0.143837 0.074271 -0.083665 -0.070446 0.192214 0.074424 0.209930 0.156741 0.169393
polarizability: 2.52253588e+02 -1.66353730e+00 1.90367480e+02 -1.68208509e+01 -2.79792118e+00 1.14323503e+02
1716.lowfreq: -6.1796 -0.0014 0.0012 0.0013 4.2702 6.1253 24.4833 38.2822 41.7994
frequency: 24.3739 37.9471 41.7442 64.2679 68.9371 88.8546 100.5913 110.5515 132.5381 157.2848 192.4803 207.2693 229.2845 254.2129 291.7247 295.0865 347.1418 348.9690 377.3497 389.9058 408.3097 427.5184 432.7868 442.6715 478.3396 536.8165 603.0175 617.6626 624.3774 633.7216 637.2394 668.4698 695.8598 704.6337 743.1343 762.9006 788.2495 809.5205 849.9648 906.9800 947.4012 957.0040 966.6329 1007.3040 1009.0208 1035.7437 1048.7181 1101.4714 1129.5861 1131.8818 1141.8120 1150.5997 1155.0177 1166.5307 1201.6137 1221.6903 1234.9670 1257.0316 1262.8506 1286.0939 1291.5081 1300.7531 1344.4554 1349.5665 1371.5186 1408.4431 1419.4562 1426.8794 1432.7347 1441.8294 1446.7288 1472.1809 1472.8254 1477.7448 1478.2396 1503.5150 1571.3510 1614.0714 1645.6157 3008.6714 3012.7895 3026.1118 3028.8051 3034.4611 3086.3198 3098.3278 3098.4719 3102.2030 3104.8534 3118.2456 3139.2651 3140.0584 3247.9461
redmass: 6.4407 6.5023 5.3812 4.9530 1.0478 3.4053 1.5790 2.6211 3.9628 6.8314 5.3308 5.0367 2.2495 5.2303 5.1487 2.9641 3.4652 5.6721 6.8124 8.9202 5.6409 5.2085 7.2088 3.4518 6.9640 5.7146 4.0738 6.2615 6.2754 3.5550 5.6660 8.8953 6.8148 10.3546 9.8484 4.4695 4.5472 1.6213 1.5749 3.8213 1.5871 4.5466 1.8759 2.6673 2.5638 4.6887 3.1720 1.0513 1.3024 1.3011 1.4236 1.6418 1.2242 2.0841 2.4533 3.2045 2.1901 1.2868 3.8118 1.5478 1.1727 7.0037 1.6989 1.8913 3.1362 1.7604 1.3037 1.2449 1.1160 1.1358 1.5072 1.2406 1.0878 1.0423 1.0743 2.7128 8.2814 10.8663 10.0650 1.0335 1.0328 1.0556 1.0594 1.0591 1.0904 1.1070 1.1026 1.1014 1.1022 1.1085 1.1025 1.1013 1.0990
irintensity: 0.2376 0.3205 0.6105 2.9095 0.0586 0.1714 1.7776 1.4052 8.9780 1.0210 4.0587 6.0601 2.5882 3.8555 0.3119 1.0918 13.9151 1.3101 17.7242 6.6987 4.4254 3.3220 15.0977 3.5336 20.0014 0.8237 9.5242 3.3086 4.3241 1.9951 7.9168 0.2115 28.6261 14.0244 9.0788 1.4413 2.9517 14.9358 10.6784 5.3439 1.5278 37.1975 5.5420 57.8406 13.4620 10.3631 8.1063 1.1650 0.3264 0.1277 2.7254 12.2133 0.4590 50.4033 58.2342 20.5608 30.4323 10.6751 22.9090 7.3195 16.1780 26.6646 12.1941 55.0192 11.3755 51.1463 50.9811 52.0153 26.9431 7.6426 182.3815 13.1211 18.7548 16.8489 1.9461 145.9278 6.1844 704.0345 319.8651 35.7552 26.2089 14.0518 14.5456 33.2348 2.2598 1.2431 16.6883 1.6323 16.3635 16.8298 0.7167 0.4820 2.1307
temp: 298.150 k
press: 1.00000 atm
elementType: 16 16 8 8 7 7 7 7 6 6 6 6 6 6 6 6 6 6 6 1 1 1 1 1 1 1 1 1 1 1 1 1 1
symmnumber: 1
zpe: 655922.1 jmol-1
zpe.correction: 0.249828 hartree
zpe.thermalcorrener: 0.268475 hartree
zpe.thermalcorrenthalpy: 0.269419 hartree
zpe.thermalcorrgfe: 0.200986 hartree
zpe.sumelectzpe: -1591.773753 hartree
zpe.sumelectthermal: -1591.755106 hartree
zpe.sumelectthermalent: -1591.754161 hartree
zpe.sumelectthermalfe: -1591.822595 hartree
dipole: 4.4334 -2.5978 -1.1432
dipole: 5.2641
quadrupole: -117.8138 -131.3071 -126.4849
quadrupole: -6.8545 0.9980 2.6305
quadrupole: 7.3881 -6.1051 -1.2830 -6.8545 0.9980 2.6305
hfenergy: -1592.0235809 hartree
pointgroup: C01 [X(C11H14N4O2S2)]
dipole: -1.7990826 0.9279346 -0.4375666 debye
polarizability: 252.639747|1.673101|190.4224312|14.9951252|2.8755366|113.8823927 unknown
InChI: InChI=1S/C11H14N4O2S2/c1-13-9-8(10(16)14(2)11(13)17)15(6-12-9)5-7-18-3-4-19-7/h6-7H,3-5H2,1-2H3
charge 0 multiplicity 1
33 atoms
S  -3.191059 0.751576 1.355508
S  -4.075893 -1.722766 -0.277961
O  0.260774 -2.290369 -0.307126
O  4.468211 -0.394307 0.677945
N  -0.683088 0.644049 -0.803336
N  2.730872 1.08164 0.118255
N  2.368429 -1.309309 0.175911
N  0.741061 2.414793 -0.517849
C  -1.918176 -0.117269 -1.06696
C  -2.591958 -0.63187 0.225631
C  0.558228 0.11142 -0.411986
C  1.403179 1.222172 -0.252978
C  -4.903127 0.822211 0.550436
C  -5.428031 -0.61194 0.461652
C  0.98235 -1.247161 -0.199222
C  -0.518933 2.019881 -0.839792
C  3.263911 -0.210048 0.344028
C  3.594059 2.268649 0.276752
C  2.95634 -2.645615 0.427681
H  -2.612594 0.529638 -1.629125
H  -1.660415 -0.989273 -1.693485
H  -1.896014 -1.259734 0.803157
H  -4.825792 1.294399 -0.442831
H  -5.528449 1.448507 1.20905
H  -5.686969 -1.00447 1.456963
H  -6.296816 -0.684794 -0.215078
H  -1.32882 2.696812 -1.098325
H  4.594027 1.915926 0.567612
H  3.182295 2.933921 1.053861
H  3.646703 2.826902 -0.672821
H  2.160188 -3.388293 0.273256
H  3.343049 -2.699814 1.458335
H  3.794457 -2.826165 -0.264962
