program: Orca
programVersion: 5.0.2
elementType: S P O O O O O N N N C C C C C C C C C C C C C C H H H H H H H H H H H H H H H H H H H H
charge: 0
multiplicity: 1
keywords: wb97x-d3
keywords: def2-TZVPP
keywords: def2/J RIJCOSX
keywords: DEFGRID2
keywords: scfconv7
keywords: smallprint printgap noloewdin
keywords: NOSOSCF
formula: C14H20N3O5PS
InChI: InChI=1/C14H20N3O5PS/c1-5-19-14(18)11-9-17-12(15-10(11)4)8-13(16-17)22-23(24,20-6-2)21-7-3/h8-9H,5-7H2,1-4H3
44 atoms
S  3.162434 2.165686 0.399546
P  3.413887 0.275359 0.221264
O  2.377056 -0.680103 1.051759
O  4.77858 -0.321108 0.774848
O  3.317442 -0.381005 -1.217911
O  -5.360762 0.173425 -0.923822
O  -3.833626 0.688397 -2.460114
N  -0.82747 -0.3188 0.057681
N  -2.332663 -1.360517 1.5559
N  0.47403 -0.094317 -0.143148
C  -1.081319 -1.038179 1.212842
C  -3.107408 -0.230424 -0.406536
C  -1.816308 0.076479 -0.744285
C  -3.331839 -0.984211 0.798261
C  1.044104 -0.671148 0.892498
C  0.151974 -1.27695 1.784808
C  -4.685221 -1.412141 1.267298
C  -4.126417 0.251996 -1.370572
C  5.508375 0.262478 1.873837
C  3.608995 0.335319 -2.43792
C  -6.428656 0.595363 -1.790943
C  4.81576 0.082246 3.201581
C  2.339163 0.763322 -3.126804
C  -7.72611 0.343356 -1.068034
H  -1.533899 0.629959 -1.62905
H  0.371222 -1.808076 2.69526
H  -5.220067 -1.97804 0.505111
H  -4.568908 -2.042454 2.145873
H  -5.308125 -0.559895 1.538545
H  5.689412 1.318442 1.664144
H  6.468531 -0.25048 1.864538
H  4.175461 -0.362183 -3.053745
H  4.25211 1.19295 -2.232131
H  -6.308537 1.654691 -2.026283
H  -6.384947 0.032803 -2.725544
H  3.888489 0.652755 3.263823
H  5.474481 0.44536 3.991509
H  4.598378 -0.966281 3.405079
H  1.686535 -0.086246 -3.328884
H  2.593597 1.223572 -4.082351
H  1.787745 1.495946 -2.538286
H  -7.788136 0.910518 -0.138815
H  -8.553984 0.656967 -1.704047
H  -7.863076 -0.714414 -0.841721
elementType: S P O N C H
totalener: -1825.71257675 hartree
nucrepener: 2468.46444011 hartree
electener: -4294.17701686 hartree
oneelecener: -7414.13129055 hartree
twoeener: 3119.95427369 hartree
cpcmener: -0.02952871 hartree
kineticenergy: 1819.71100993 hartree
xcener: -138.288747793632 hartree
chargesum: 0.0000000
charge: -0.439314 0.759610 -0.312842 -0.343375 -0.338825 -0.271781 -0.467994 0.179483 -0.347214 -0.406545 0.204819 -0.123293 0.093004 0.190337 0.331907 -0.322942 -0.261827 0.467305 0.026770 0.043543 0.032121 -0.237638 -0.237689 -0.258565 0.152920 0.166769 0.108684 0.098525 0.106755 0.094579 0.108776 0.106080 0.087714 0.100426 0.099889 0.080284 0.098246 0.091133 0.087275 0.102334 0.074740 0.090355 0.096376 0.089085
qa: -0.4393 0.7596 -0.3128 -0.3434 -0.3388 -0.2718 -0.4680 0.1795 -0.3472 -0.4065 0.2048 -0.1233 0.0930 0.1903 0.3319 -0.3229 -0.2618 0.4673 0.0268 0.0435 0.0321 -0.2376 -0.2377 -0.2586 0.1529 0.1668 0.1087 0.0985 0.1068 0.0946 0.1088 0.1061 0.0877 0.1004 0.0999 0.0803 0.0982 0.0911 0.0873 0.1023 0.0747 0.0904 0.0964 0.0891
va: 1.9812 5.4803 2.1761 2.1224 2.1128 2.1559 2.0442 3.4217 3.1324 2.8014 4.0316 3.7323 4.0182 3.8368 4.0661 3.8874 3.9235 4.1183 3.8646 3.8587 3.8478 3.8839 3.9012 3.9651 1.0278 0.9997 1.0014 1.0243 1.0017 1.0096 0.9920 0.9960 1.0105 0.9946 0.9971 1.0190 1.0090 1.0065 1.0067 1.0104 1.0189 1.0028 1.0073 1.0023
dispcorr: -0.020261202 hartree
energy: -1825.732837947851
dipole: -14.86448 13.63666 -1.22782 0.48341 -0.93664 -0.45322 -2.96417 2.85788 -0.10629
magnitude: 1.31310 au
magnitude: 3.33764 debye
