program: Orca
programVersion: 5.0.2
elementType: S P O O O O O N N N C C C C C C C C C C C C C C H H H H H H H H H H H H H H H H H H H H
charge: 0
multiplicity: 1
keywords: wb97x-d3
keywords: def2-TZVPP
keywords: def2/J RIJCOSX
keywords: DEFGRID2
keywords: scfconv7
keywords: smallprint printgap noloewdin
keywords: NOSOSCF
formula: C14H20N3O5PS
InChI: InChI=1/C14H20N3O5PS/c1-5-19-14(18)11-9-17-12(15-10(11)4)8-13(16-17)22-23(24,20-6-2)21-7-3/h8-9H,5-7H2,1-4H3
44 atoms
S  2.766197 0.739257 -1.876984
P  3.04266 0.054243 -0.110276
O  2.198727 -1.297383 0.277065
O  2.703343 0.981597 1.130477
O  4.48872 -0.481254 0.256062
O  -4.363941 1.532596 -0.082533
O  -5.779832 -0.186808 -0.16184
N  -1.120941 -0.70841 0.206497
N  -2.372211 -2.705273 0.423324
N  0.132882 -0.250224 0.164086
C  -1.190404 -2.082937 0.362341
C  -3.443459 -0.58466 0.127268
C  -2.221578 0.034471 0.087726
C  -3.475004 -2.010402 0.309858
C  0.858092 -1.341444 0.283841
C  0.116654 -2.521322 0.415043
C  -4.745097 -2.791876 0.38764
C  -4.657721 0.243121 -0.049504
C  2.43425 2.392663 1.023992
C  5.495501 -0.84549 -0.709606
C  -5.417145 2.479655 -0.316168
C  3.69901 3.201756 0.885002
C  6.613466 0.164075 -0.69545
C  -4.797474 3.853194 -0.276301
H  -2.070089 1.095901 -0.044053
H  0.478005 -3.529218 0.527325
H  -4.507293 -3.83212 0.598079
H  -5.404897 -2.420324 1.170979
H  -5.299494 -2.748657 -0.549685
H  1.909462 2.643719 1.944571
H  1.753716 2.574919 0.190532
H  5.055039 -0.92566 -1.704807
H  5.849656 -1.834471 -0.420042
H  -5.876146 2.283107 -1.28755
H  -6.186944 2.374045 0.450863
H  3.447336 4.262808 0.913378
H  4.203186 3.008131 -0.062491
H  4.395751 3.001019 1.699082
H  7.393758 -0.155959 -1.387064
H  7.061432 0.253621 0.294705
H  6.268142 1.148622 -1.013034
H  -4.347438 4.061698 0.695051
H  -4.033955 3.97252 -1.045759
H  -5.568646 4.60238 -0.453422
elementType: S P O N C H
totalener: -1825.71255709 hartree
nucrepener: 2465.23898941 hartree
electener: -4290.95154651 hartree
oneelecener: -7407.31317386 hartree
twoeener: 3116.36162736 hartree
cpcmener: -0.02866895 hartree
kineticenergy: 1819.73027678 hartree
xcener: -138.293025383856 hartree
chargesum: -0.0000000
charge: -0.436355 0.756967 -0.319091 -0.339822 -0.339797 -0.282220 -0.455841 0.175463 -0.347566 -0.408568 0.210710 -0.133154 0.076565 0.196332 0.328506 -0.325932 -0.250816 0.474308 0.047341 0.048932 0.034388 -0.235483 -0.234480 -0.255503 0.160591 0.166654 0.095264 0.104074 0.104623 0.109312 0.090526 0.084158 0.105699 0.100768 0.096722 0.097157 0.073550 0.091758 0.094710 0.090456 0.078998 0.088720 0.088339 0.093035
qa: -0.4364 0.7570 -0.3191 -0.3398 -0.3398 -0.2822 -0.4558 0.1755 -0.3476 -0.4086 0.2107 -0.1332 0.0766 0.1963 0.3285 -0.3259 -0.2508 0.4743 0.0473 0.0489 0.0344 -0.2355 -0.2345 -0.2555 0.1606 0.1667 0.0953 0.1041 0.1046 0.1093 0.0905 0.0842 0.1057 0.1008 0.0967 0.0972 0.0735 0.0918 0.0947 0.0905 0.0790 0.0887 0.0883 0.0930
va: 1.9835 5.4858 2.1949 2.0951 2.1178 2.1251 2.0580 3.4130 3.1310 2.7716 4.0271 3.7507 4.0299 3.8646 4.0629 3.8835 3.9173 4.1189 3.8415 3.8358 3.8468 3.9262 3.9277 3.9676 1.0209 1.0003 1.0219 1.0039 1.0044 0.9919 1.0133 1.0180 0.9958 0.9954 0.9957 1.0094 1.0153 1.0056 1.0095 1.0041 1.0088 1.0031 1.0024 1.0071
dispcorr: -0.019420143 hartree
energy: -1825.731977236657
dipole: 1.43771 -1.18330 0.25441 18.28161 -16.52245 1.75917 1.00855 -0.56526 0.44329
magnitude: 1.83191 au
magnitude: 4.65634 debye
