program: Orca
programVersion: 5.0.2
elementType: S P O O O O O N N N C C C C C C C C C C C C C C H H H H H H H H H H H H H H H H H H H H
charge: 0
multiplicity: 1
keywords: wb97x-d3
keywords: def2-TZVPP
keywords: def2/J RIJCOSX
keywords: DEFGRID2
keywords: scfconv7
keywords: smallprint printgap noloewdin
keywords: NOSOSCF
formula: C14H20N3O5PS
InChI: InChI=1/C14H20N3O5PS/c1-5-19-14(18)11-9-17-12(15-10(11)4)8-13(16-17)22-23(24,20-6-2)21-7-3/h8-9H,5-7H2,1-4H3
44 atoms
S  2.561913 1.936584 1.375183
P  3.025652 0.337276 0.429168
O  2.215834 -1.020857 0.851054
O  4.453106 -0.302837 0.692218
O  2.927962 0.377284 -1.156369
O  -4.299656 1.012642 -1.325923
O  -5.69705 -0.600827 -0.688115
N  -1.069966 -0.747347 0.145443
N  -2.323878 -2.507903 1.108314
N  0.178466 -0.283485 0.031068
C  -1.148553 -1.904788 0.901382
C  -3.375173 -0.778737 -0.171935
C  -2.158581 -0.183358 -0.37964
C  -3.413571 -1.991344 0.600906
C  0.887228 -1.14639 0.726795
C  0.14299 -2.183272 1.299892
C  -4.67553 -2.738777 0.881701
C  -4.582464 -0.14088 -0.743094
C  5.644217 0.513982 0.628322
C  2.251244 1.405022 -1.909332
C  -5.375225 1.756159 -1.92297
C  6.145437 0.837005 2.012124
C  3.230306 2.444733 -2.391233
C  -4.78533 3.005895 -2.52338
H  -2.000862 0.723971 -0.944398
H  0.490525 -3.002382 1.905956
H  -5.151976 -3.083756 -0.035551
H  -4.442656 -3.605203 1.496551
H  -5.402349 -2.123359 1.411099
H  5.458778 1.426932 0.056934
H  6.372235 -0.074713 0.0716
H  1.462794 1.856367 -1.307331
H  1.779544 0.886987 -2.743483
H  -5.862589 1.147478 -2.687368
H  -6.116696 2.000495 -1.159572
H  7.080224 1.393173 1.931514
H  6.344339 -0.068146 2.586487
H  5.434845 1.452415 2.563271
H  3.668842 2.998089 -1.560252
H  2.708106 3.160375 -3.027678
H  4.033419 2.000475 -2.979942
H  -4.303784 3.628252 -1.768555
H  -4.0583 2.775398 -3.302635
H  -5.584065 3.593084 -2.976959
elementType: S P O N C H
totalener: -1825.71312231 hartree
nucrepener: 2469.76242785 hartree
electener: -4295.47555015 hartree
oneelecener: -7416.12409875 hartree
twoeener: 3120.64854860 hartree
cpcmener: -0.02882135 hartree
kineticenergy: 1819.71984695 hartree
xcener: -138.290520505451 hartree
chargesum: -0.0000000
charge: -0.437262 0.747191 -0.314480 -0.336884 -0.338851 -0.283172 -0.456861 0.174141 -0.346480 -0.413762 0.209905 -0.133542 0.077519 0.197531 0.335892 -0.326551 -0.250732 0.477512 0.043862 0.065020 0.034126 -0.235613 -0.246921 -0.255517 0.160961 0.167675 0.104170 0.095626 0.104137 0.084394 0.107465 0.086809 0.107794 0.098730 0.098831 0.093418 0.090429 0.076329 0.076902 0.098145 0.092029 0.089008 0.088336 0.092745
qa: -0.4373 0.7472 -0.3145 -0.3369 -0.3389 -0.2832 -0.4569 0.1741 -0.3465 -0.4138 0.2099 -0.1335 0.0775 0.1975 0.3359 -0.3266 -0.2507 0.4775 0.0439 0.0650 0.0341 -0.2356 -0.2469 -0.2555 0.1610 0.1677 0.1042 0.0956 0.1041 0.0844 0.1075 0.0868 0.1078 0.0987 0.0988 0.0934 0.0904 0.0763 0.0769 0.0981 0.0920 0.0890 0.0883 0.0927
va: 1.9810 5.5085 2.1966 2.1160 2.0867 2.1273 2.0569 3.4311 3.1304 2.7982 4.0264 3.7611 4.0277 3.8623 4.0560 3.8863 3.9174 4.1134 3.8834 3.8056 3.8466 3.9329 3.9436 3.9678 1.0197 0.9996 1.0044 1.0219 1.0041 0.9975 0.9953 1.0187 0.9936 0.9958 0.9953 1.0079 1.0043 1.0192 1.0144 1.0098 1.0034 1.0027 1.0028 1.0070
dispcorr: -0.019739291 hartree
energy: -1825.732861596582
dipole: -0.60854 0.72662 0.11808 14.76269 -13.42028 1.34242 -12.18077 10.21143 -1.96933
magnitude: 2.38627 au
magnitude: 6.06542 debye
