program: Orca
programVersion: 5.0.2
elementType: S P O O O O O N N N C C C C C C C C C C C C C C H H H H H H H H H H H H H H H H H H H H
charge: 0
multiplicity: 1
keywords: wb97x-d3
keywords: def2-TZVPP
keywords: def2/J RIJCOSX
keywords: DEFGRID2
keywords: scfconv7
keywords: smallprint printgap noloewdin
keywords: NOSOSCF
formula: C14H20N3O5PS
InChI: InChI=1/C14H20N3O5PS/c1-5-19-14(18)11-9-17-12(15-10(11)4)8-13(16-17)22-23(24,20-6-2)21-7-3/h8-9H,5-7H2,1-4H3
44 atoms
S  2.954157 1.867423 1.501447
P  3.231605 0.16493 0.668774
O  2.198879 -1.028505 1.109722
O  4.527239 -0.662623 1.064254
O  3.233373 0.111723 -0.917844
O  -5.429157 0.353701 -0.939571
O  -3.852095 1.397986 -2.114911
N  -0.940095 -0.423157 0.036983
N  -2.487198 -1.960042 0.957711
N  0.360299 -0.116105 0.03286
C  -1.233918 -1.511029 0.842963
C  -3.193698 -0.207551 -0.508978
C  -1.897752 0.218563 -0.632371
C  -3.456097 -1.352112 0.321586
C  0.886236 -1.00779 0.845261
C  -0.032315 -1.912058 1.389038
C  -4.813944 -1.948797 0.506576
C  -4.180143 0.590156 -1.276898
C  5.769813 -0.034276 1.435091
C  2.696377 1.13781 -1.776351
C  -6.471539 1.064564 -1.631897
C  6.513839 0.517934 0.245308
C  3.800119 2.014022 -2.311502
C  -7.789037 0.596836 -1.068626
H  -1.591906 1.060068 -1.238725
H  0.152168 -2.723085 2.072541
H  -4.718389 -2.865585 1.083653
H  -5.478801 -1.27437 1.045974
H  -5.290116 -2.185699 -0.444185
H  6.342041 -0.822737 1.921238
H  5.575986 0.744065 2.17593
H  1.952259 1.72861 -1.242651
H  2.185565 0.607786 -2.579781
H  -6.341038 2.138441 -1.484799
H  -6.405608 0.856703 -2.701711
H  6.671669 -0.243758 -0.518621
H  7.492372 0.870681 0.573306
H  5.995709 1.364293 -0.20698
H  4.56376 1.431626 -2.827922
H  4.274287 2.589752 -1.516295
H  3.378249 2.720618 -3.027497
H  -7.868464 0.804856 -0.001168
H  -8.598458 1.126707 -1.571344
H  -7.940833 -0.471176 -1.228827
elementType: S P O N C H
totalener: -1825.71246355 hartree
nucrepener: 2460.14005801 hartree
electener: -4285.85252156 hartree
oneelecener: -7397.11820411 hartree
twoeener: 3111.26568254 hartree
cpcmener: -0.02885624 hartree
kineticenergy: 1819.72494766 hartree
xcener: -138.292534527119 hartree
chargesum: -0.0000000
charge: -0.436529 0.738939 -0.314776 -0.339452 -0.334377 -0.272073 -0.467863 0.170582 -0.346968 -0.413980 0.207934 -0.123136 0.089422 0.192777 0.338872 -0.326261 -0.263520 0.468386 0.034639 0.070432 0.032748 -0.245826 -0.261328 -0.258373 0.152553 0.166886 0.097963 0.106343 0.109811 0.108475 0.093258 0.089282 0.106532 0.099551 0.100840 0.092559 0.100531 0.082800 0.094477 0.079519 0.102854 0.090077 0.095915 0.089507
qa: -0.4365 0.7389 -0.3148 -0.3395 -0.3344 -0.2721 -0.4679 0.1706 -0.3470 -0.4140 0.2079 -0.1231 0.0894 0.1928 0.3389 -0.3263 -0.2635 0.4684 0.0346 0.0704 0.0327 -0.2458 -0.2613 -0.2584 0.1526 0.1669 0.0980 0.1063 0.1098 0.1085 0.0933 0.0893 0.1065 0.0996 0.1008 0.0926 0.1005 0.0828 0.0945 0.0795 0.1029 0.0901 0.0959 0.0895
va: 1.9870 5.5051 2.1966 2.1214 2.0828 2.1553 2.0440 3.4479 3.1316 2.8067 4.0275 3.7301 4.0182 3.8340 4.0571 3.8847 3.9241 4.1185 3.8559 3.7930 3.8483 3.9000 3.9479 3.9651 1.0283 0.9997 1.0243 1.0017 1.0012 0.9922 1.0124 1.0164 0.9947 0.9950 0.9969 1.0064 1.0098 1.0051 1.0012 1.0083 1.0107 1.0029 1.0073 1.0019
dispcorr: -0.020510867 hartree
energy: -1825.732974420890
dipole: -8.08945 6.81882 -1.27062 5.90907 -5.99282 -0.08375 -11.61556 10.56597 -1.04959
magnitude: 1.65019 au
magnitude: 4.19446 debye
