program: Orca
programVersion: 5.0.2
elementType: S P O O O O O N N N C C C C C C C C C C C C C C H H H H H H H H H H H H H H H H H H H H
charge: 0
multiplicity: 1
keywords: wb97x-d3
keywords: def2-TZVPP
keywords: def2/J RIJCOSX
keywords: DEFGRID2
keywords: scfconv7
keywords: smallprint printgap noloewdin
keywords: NOSOSCF
formula: C14H20N3O5PS
InChI: InChI=1/C14H20N3O5PS/c1-5-19-14(18)11-9-17-12(15-10(11)4)8-13(16-17)22-23(24,20-6-2)21-7-3/h8-9H,5-7H2,1-4H3
44 atoms
S  3.053494 0.647124 -1.900298
P  3.137618 0.047257 -0.083397
O  2.230285 -1.271217 0.273353
O  2.704174 1.038949 1.073703
O  4.530113 -0.490296 0.451478
O  -4.301016 1.617338 -0.498803
O  -5.735512 -0.01404 0.015268
N  -1.076819 -0.63281 0.055511
N  -2.362728 -2.603515 0.304499
N  0.186176 -0.19404 0.033392
C  -1.170631 -1.999907 0.252876
C  -3.397644 -0.469701 -0.026076
C  -2.165128 0.126815 -0.084179
C  -3.453121 -1.892841 0.175153
C  0.890347 -1.290754 0.216847
C  0.127172 -2.455382 0.358357
C  -4.734596 -2.657732 0.237974
C  -4.606401 0.374423 -0.160364
C  2.481393 2.450042 0.885722
C  5.563376 -1.024942 -0.404689
C  -5.3582 2.584412 -0.627222
C  3.77266 3.226799 0.914249
C  6.617647 0.017211 -0.675929
C  -5.78865 3.143361 0.708306
H  -1.992974 1.183472 -0.229268
H  0.467152 -3.464571 0.516537
H  -4.507458 -3.717993 0.323158
H  -5.336188 -2.36406 1.097999
H  -5.344966 -2.50248 -0.65099
H  1.829805 2.739618 1.708678
H  1.938225 2.615195 -0.046198
H  5.132286 -1.399934 -1.334762
H  5.977291 -1.875346 0.136083
H  -4.929153 3.368121 -1.249486
H  -6.198654 2.150642 -1.170587
H  4.414799 2.978177 0.068489
H  4.32603 3.050454 1.837042
H  3.548815 4.292933 0.857372
H  7.416309 -0.426416 -1.272105
H  7.059364 0.39026 0.248781
H  6.213023 0.860469 -1.235964
H  -6.525079 3.930164 0.538829
H  -6.250795 2.390644 1.3461
H  -4.948598 3.586306 1.244266
elementType: S P O N C H
totalener: -1825.71224965 hartree
nucrepener: 2462.68700359 hartree
electener: -4288.39925324 hartree
oneelecener: -7402.29992819 hartree
twoeener: 3113.90067495 hartree
cpcmener: -0.02841929 hartree
kineticenergy: 1819.70950938 hartree
xcener: -138.289691835373 hartree
chargesum: 0.0000000
charge: -0.436114 0.755091 -0.316799 -0.338256 -0.341113 -0.288329 -0.457445 0.176566 -0.347124 -0.411957 0.211242 -0.141219 0.075477 0.192744 0.329745 -0.327530 -0.250393 0.482185 0.045093 0.047575 0.039548 -0.234214 -0.237379 -0.254157 0.159748 0.166664 0.095758 0.104297 0.104379 0.109452 0.090792 0.087478 0.107225 0.108253 0.090771 0.076270 0.090951 0.096247 0.096525 0.090587 0.076145 0.096358 0.091085 0.087778
qa: -0.4361 0.7551 -0.3168 -0.3383 -0.3411 -0.2883 -0.4574 0.1766 -0.3471 -0.4120 0.2112 -0.1412 0.0755 0.1927 0.3297 -0.3275 -0.2504 0.4822 0.0451 0.0476 0.0395 -0.2342 -0.2374 -0.2542 0.1597 0.1667 0.0958 0.1043 0.1044 0.1095 0.0908 0.0875 0.1072 0.1083 0.0908 0.0763 0.0910 0.0962 0.0965 0.0906 0.0761 0.0964 0.0911 0.0878
va: 1.9827 5.4870 2.1953 2.0991 2.1111 2.1272 2.0490 3.4107 3.1307 2.7715 4.0264 3.7514 4.0347 3.8677 4.0642 3.8842 3.9162 4.1225 3.8410 3.8426 3.8411 3.9338 3.9190 3.9192 1.0240 1.0003 1.0220 1.0050 1.0037 0.9921 1.0140 1.0126 0.9956 0.9957 1.0104 1.0123 1.0058 1.0090 1.0096 1.0033 1.0157 1.0066 1.0124 1.0044
dispcorr: -0.019632958 hartree
energy: -1825.731882607879
dipole: -1.14904 1.27101 0.12196 16.24641 -14.57597 1.67044 3.33708 -2.98218 0.35490
magnitude: 1.71208 au
magnitude: 4.35176 debye
