program: Orca
programVersion: 5.0.2
elementType: S P O O O O O N N N C C C C C C C C C C C C C C H H H H H H H H H H H H H H H H H H H H
charge: 0
multiplicity: 1
keywords: wb97x-d3
keywords: def2-TZVPP
keywords: def2/J RIJCOSX
keywords: DEFGRID2
keywords: scfconv7
keywords: smallprint printgap noloewdin
keywords: NOSOSCF
formula: C14H20N3O5PS
InChI: InChI=1/C14H20N3O5PS/c1-5-19-14(18)11-9-17-12(15-10(11)4)8-13(16-17)22-23(24,20-6-2)21-7-3/h8-9H,5-7H2,1-4H3
44 atoms
S  2.607436 1.986014 1.794534
P  3.084687 0.454481 0.7500
O  2.276208 -0.932556 1.078177
O  4.520049 -0.183208 0.982659
O  2.996105 0.577711 -0.830768
O  -4.207272 1.059206 -1.299989
O  -5.571285 -0.62377 -0.788328
N  -0.973065 -0.702255 0.198594
N  -2.171587 -2.660774 0.775534
N  0.249689 -0.164007 0.252181
C  -1.025323 -1.973898 0.745905
C  -3.250659 -0.798643 -0.273645
C  -2.061558 -0.117163 -0.30432
C  -3.260559 -2.121347 0.291818
C  0.968697 -1.098395 0.837148
C  0.255188 -2.253459 1.17562
C  -4.48855 -2.968055 0.36651
C  -4.465085 -0.141149 -0.805152
C  5.659192 0.617069 1.362133
C  2.258188 1.595936 -1.538055
C  -5.309826 1.822663 -1.815981
C  6.128706 1.531479 0.257044
C  1.651001 0.980961 -2.77186
C  -4.771765 3.150311 -2.281912
H  -1.929171 0.877743 -0.705013
H  0.616649 -3.146841 1.655509
H  -4.921192 -3.141634 -0.61838
H  -4.227293 -3.9286 0.804727
H  -5.260812 -2.505961 0.981003
H  6.428031 -0.109381 1.61942
H  5.416248 1.182808 2.263762
H  2.959034 2.391527 -1.79554
H  1.488176 2.021046 -0.89519
H  -5.777088 1.279261 -2.640071
H  -6.059299 1.959277 -1.033486
H  6.343109 0.981226 -0.659296
H  7.049403 2.022483 0.574986
H  5.40284 2.315299 0.035424
H  2.411527 0.568866 -3.435928
H  1.109388 1.750086 -3.323543
H  0.945211 0.190883 -2.515062
H  -4.318397 3.712194 -1.464676
H  -4.034145 3.032365 -3.076583
H  -5.594191 3.74642 -2.677894
elementType: S P O N C H
totalener: -1825.71328022 hartree
nucrepener: 2487.13233808 hartree
electener: -4312.84561831 hartree
oneelecener: -7450.73528109 hartree
twoeener: 3137.88966278 hartree
cpcmener: -0.02844469 hartree
kineticenergy: 1819.71377165 hartree
xcener: -138.290631043877 hartree
chargesum: -0.0000000
charge: -0.436882 0.746070 -0.314862 -0.340328 -0.337602 -0.284581 -0.457039 0.176969 -0.346920 -0.420839 0.210398 -0.130048 0.070968 0.196095 0.343107 -0.330250 -0.249778 0.475953 0.028455 0.056609 0.036235 -0.240132 -0.251082 -0.255898 0.163611 0.166849 0.104322 0.096102 0.104561 0.110110 0.095695 0.115492 0.095794 0.097819 0.097694 0.092125 0.099101 0.079635 0.093610 0.090751 0.082100 0.088511 0.088862 0.092637
qa: -0.4369 0.7461 -0.3149 -0.3403 -0.3376 -0.2846 -0.4570 0.1770 -0.3469 -0.4208 0.2104 -0.1300 0.0710 0.1961 0.3431 -0.3302 -0.2498 0.4760 0.0285 0.0566 0.0362 -0.2401 -0.2511 -0.2559 0.1636 0.1668 0.1043 0.0961 0.1046 0.1101 0.0957 0.1155 0.0958 0.0978 0.0977 0.0921 0.0991 0.0796 0.0936 0.0908 0.0821 0.0885 0.0889 0.0926
va: 1.9858 5.4985 2.2004 2.1194 2.0788 2.1282 2.0562 3.4322 3.1308 2.7932 4.0272 3.7592 4.0211 3.8622 4.0501 3.8883 3.9152 4.1133 3.8604 3.7815 3.8460 3.8885 3.9529 3.9680 1.0180 1.0004 1.0041 1.0219 1.0043 0.9921 1.0108 0.9954 1.0170 0.9955 0.9962 1.0066 1.0083 1.0161 1.0039 1.0060 1.0101 1.0028 1.0028 1.0068
dispcorr: -0.020256501 hartree
energy: -1825.733536724304
dipole: -4.49453 4.50563 0.01110 12.77975 -11.42661 1.35314 -17.07175 15.26367 -1.80808
magnitude: 2.25838 au
magnitude: 5.74034 debye
