program: Gaussian 09
title: 000065940
version: EM64L-G09RevD.01
frameworkgroup: C1[X(C14H15NO5S2)]
method: RPBEPBE
basis: SDD
operation: Freq
keyword: #p
keyword: freq=noraman
keyword: PBEPBE/SDD
title: #p freq=noraman PBEPBE/SDD
converged: YES YES NO NO
title: Mulliken charges:
elementType: S S O O O O O N C C C C C C C C C C C C C C H H H H H H H H H H H H H H H
charge: 0.929231 0.202314 -0.546866 -0.533327 -0.222007 -0.415122 -0.205512 -0.521120 -0.365098 -0.494303 0.051915 0.004382 -0.282236 -0.237491 -0.262320 -0.064859 -0.240118 -0.206721 -0.207987 -0.243097 -0.333422 0.189590 0.231831 0.273416 0.225895 0.221820 0.315908 0.250339 0.291834 0.284396 0.249604 0.286661 0.238359 0.236843 0.262645 0.243596 0.391027
chargesum: 0.00000
title: Mulliken charges with hydrogens summed into heavy atoms:
elementType: S S O O O O O N C C C C C C C C C C C C C C
charge: 0.929231 0.202314 -0.546866 -0.533327 -0.222007 -0.024095 -0.205512 -0.205212 0.140149 -0.046588 0.051915 0.004382 -0.031897 0.054343 0.022076 -0.064859 0.009486 0.079940 0.030373 -0.006254 0.172818 0.189590
polarizability: 2.59216775e+02 3.39653060e+01 1.86746718e+02 1.14158245e+00 9.70055265e+00 1.74112265e+02
1716.lowfreq: -4.7347 -3.3277 0.0010 0.0013 0.0018 4.7774 17.7112 20.1553 32.2440
frequency: 17.3736 19.9551 32.2356 36.8705 42.6116 48.3224 69.4909 81.4889 101.1508 103.5238 126.7682 142.0999 162.1855 213.7608 219.0661 228.5037 246.3298 256.6115 270.8459 287.6760 321.3553 342.9175 361.7717 396.6167 409.3382 440.7351 455.1905 465.2375 486.4628 506.1628 526.5482 541.9673 566.5189 574.6727 601.0965 610.4231 654.4691 662.2845 692.0890 698.3891 724.1911 742.4841 768.1009 770.6223 796.9228 845.1693 858.8698 874.1360 880.5449 911.7565 937.8114 938.5879 975.1177 977.5026 988.6845 991.5415 1006.2414 1007.4976 1016.4672 1045.6663 1049.9075 1053.5419 1073.3026 1079.7433 1141.6412 1171.5896 1173.3733 1188.4604 1198.5692 1200.5035 1223.8907 1236.7156 1275.1729 1301.1069 1307.2729 1334.9473 1342.1409 1365.4366 1378.8895 1383.4719 1437.2275 1445.6124 1452.0232 1454.7753 1475.8539 1534.1123 1576.1890 1584.2894 1603.5003 1684.6984 2964.7416 2966.4394 2977.1668 3025.9790 3046.3632 3057.9072 3133.0899 3147.2540 3156.8409 3166.9972 3168.9269 3176.7356 3187.9983 3389.0508 3518.1430
redmass: 5.9188 6.1428 8.8129 8.7576 7.1511 8.2217 4.4515 4.5970 5.7337 4.4349 4.1980 5.8678 7.4027 5.5499 6.5878 4.1898 8.4892 5.1636 4.2347 3.9286 4.7346 4.8145 5.3745 7.0307 2.8906 3.9959 5.3439 6.7025 5.6812 4.4206 2.5622 3.2086 2.9373 4.0141 6.4648 4.1920 6.0030 1.6552 2.4967 4.6792 5.3583 1.8788 1.3538 1.3096 14.3435 1.6390 1.2358 1.9432 3.9806 2.3789 1.8244 2.6791 4.7594 6.1205 1.4048 2.0146 3.3449 2.4550 1.4779 3.4284 2.1703 1.5808 2.0494 1.5635 2.0515 1.9319 1.6035 1.1123 1.1744 1.4844 1.2070 1.3178 1.6424 1.5163 1.3034 1.7211 1.3497 1.2693 1.7077 7.9274 2.2306 1.0968 1.0895 1.9811 1.0710 7.5701 5.6803 6.7098 6.9198 9.2933 1.0600 1.0613 1.0622 1.1022 1.0981 1.0988 1.0863 1.0899 1.0941 1.0915 1.0977 1.0978 1.0989 1.0755 1.0641
irintensity: 0.2834 0.5709 1.9555 0.8868 3.4088 0.9156 1.0311 0.5499 3.0721 7.1216 2.4049 0.0960 1.6796 3.0328 4.4624 1.5969 5.7932 5.3791 3.8496 9.3188 1.5714 10.6259 11.7948 16.5454 0.1290 15.6652 49.7805 11.8359 5.9177 70.9976 48.0843 4.8186 19.0560 18.8758 0.1864 17.4221 1.7970 132.6967 32.8467 9.3249 28.7510 90.0662 149.1293 16.8178 78.8511 3.5844 7.0361 0.6799 1.2913 52.7660 12.8531 20.9805 87.2960 6.8420 0.5621 29.7342 1.4990 53.6219 1.5003 31.9592 26.6219 102.9348 206.9471 3.0031 28.1588 85.3278 79.6278 1.6062 11.1465 5.4112 4.3494 3.2857 25.8541 1.8924 4.0084 2.9669 3.1758 2.3051 21.5903 5.3530 15.9344 12.8138 33.5551 14.9912 16.6955 150.5763 2.7896 9.8710 0.6460 223.5142 4.7473 41.7253 83.6544 26.7951 15.0761 17.1748 8.8108 6.0726 2.1850 12.0992 9.9263 7.9886 4.9318 16.2138 47.1994
temp: 298.150 k
press: 1.00000 atm
elementType: 16 16 8 8 8 8 8 7 6 6 6 6 6 6 6 6 6 6 6 6 6 6 1 1 1 1 1 1 1 1 1 1 1 1 1 1 1
symmnumber: 1
zpe: 705142.5 jmol-1
zpe.correction: 0.268575 hartree
zpe.thermalcorrener: 0.291116 hartree
zpe.thermalcorrenthalpy: 0.292060 hartree
zpe.thermalcorrgfe: 0.213134 hartree
zpe.sumelectzpe: -1767.639566 hartree
zpe.sumelectthermal: -1767.617025 hartree
zpe.sumelectthermalent: -1767.616080 hartree
zpe.sumelectthermalfe: -1767.695007 hartree
dipole: 5.3323 -1.4697 5.2227
dipole: 7.6072
quadrupole: -134.1223 -138.2313 -145.2941
quadrupole: 24.1334 -3.8949 4.4758
quadrupole: 5.0936 0.9846 -6.0782 24.1334 -3.8949 4.4758
hfenergy: -1767.9081407 hartree
pointgroup: C01 [X(C14H15N1O5S2)]
dipole: 2.132269 -0.3323157 2.0737707 debye
polarizability: 251.0182591|40.9173915|195.0798195|0.3913102|9.9382695|173.9776793 unknown
InChI: InChI=1S/C14H15NO5S2/c16-13(17)10-20-14-7-6-11(21-14)8-9-15-22(18,19)12-4-2-1-3-5-12/h1-7,15-16H,8-10H2
charge 0 multiplicity 1
37 atoms
S  -3.333259 0.464618 -0.621936
S  0.402327 -2.109175 -1.097038
O  -4.647221 1.191334 0.01748
O  -3.203878 0.08671 -2.205184
O  2.738039 -0.815993 -0.627691
O  5.693386 1.080559 -0.068492
O  3.879068 1.656272 -1.409727
N  -3.143983 -1.127217 0.365277
C  -2.958202 -2.347374 -0.457342
C  -1.900491 -3.295042 0.182487
C  -0.541151 -2.682618 0.360293
C  -1.819607 1.499297 -0.170385
C  0.153663 -2.403708 1.521234
C  -0.67444 1.380276 -0.972104
C  -1.930195 2.367948 0.926895
C  1.692976 -1.48663 -0.00091
C  1.424147 -1.736406 1.33438
C  0.445573 2.177884 -0.637791
C  -0.803299 3.162344 1.241264
C  0.376979 3.061727 0.465573
C  3.682471 -0.156872 0.270835
C  4.379814 0.938656 -0.524397
H  -3.908392 -2.902069 -0.595163
H  -2.631187 -2.034679 -1.468687
H  -2.257045 -3.621188 1.177563
H  -1.855581 -4.202603 -0.454571
H  -3.996964 -1.127821 0.954249
H  -0.242704 -2.655349 2.508344
H  -0.660747 0.703438 -1.830971
H  -2.865812 2.437918 1.490617
H  2.083429 -1.465354 2.161601
H  1.360955 2.104691 -1.235108
H  -0.852144 3.859302 2.084561
H  1.242944 3.686093 0.712765
H  4.420188 -0.875502 0.669848
H  3.144488 0.321448 1.116481
H  6.136258 1.837486 -0.540549
