program: Orca
programVersion: 5.0.2
elementType: S P O O O O O N N N C C C C C C C C C C C C C C H H H H H H H H H H H H H H H H H H H H
charge: 0
multiplicity: 1
keywords: wb97x-d3
keywords: def2-TZVPP
keywords: def2/J RIJCOSX
keywords: DEFGRID2
keywords: scfconv7
keywords: smallprint printgap noloewdin
keywords: NOSOSCF
formula: C14H20N3O5PS
InChI: InChI=1/C14H20N3O5PS/c1-5-19-14(18)11-9-17-12(15-10(11)4)8-13(16-17)22-23(24,20-6-2)21-7-3/h8-9H,5-7H2,1-4H3
44 atoms
S  3.446983 0.431327 -1.861176
P  3.399295 0.135507 0.029798
O  2.02208 0.57208 0.782376
O  4.442409 0.915763 0.931966
O  3.551069 -1.356633 0.548115
O  -5.83007 0.02594 -0.603173
O  -5.147584 1.36552 1.045449
N  -1.286733 0.332562 0.355495
N  -1.953065 -1.540767 -0.92915
N  -0.203735 0.945755 0.839734
C  -0.985454 -0.795495 -0.386422
C  -3.557219 -0.008572 -0.034873
C  -2.549928 0.722454 0.535337
C  -3.204469 -1.188464 -0.777875
C  0.787115 0.197546 0.404086
C  0.390457 -0.903145 -0.366728
C  -4.207934 -2.111879 -1.388895
C  -4.919793 0.526557 0.205153
C  4.74123 2.318208 0.755899
C  4.382955 -2.326702 -0.124428
C  -7.199311 0.440888 -0.448343
C  6.216002 2.531107 0.967813
C  5.8548 -2.029872 0.020843
C  -7.890533 -0.2906 0.677913
H  -2.706081 1.615145 1.124772
H  0.99008 -1.664601 -0.835249
H  -3.690057 -2.987411 -1.772871
H  -4.952297 -2.440093 -0.6644
H  -4.740318 -1.641129 -2.214655
H  4.148649 2.875731 1.481099
H  4.44568 2.641521 -0.24436
H  4.09129 -2.381295 -1.175016
H  4.128366 -3.275285 0.344831
H  -7.250268 1.522566 -0.31802
H  -7.661214 0.197437 -1.403629
H  6.440606 3.592543 0.863903
H  6.806454 1.989786 0.228817
H  6.530641 2.220514 1.964347
H  6.422437 -2.854942 -0.411084
H  6.14585 -1.936447 1.067134
H  6.148416 -1.121889 -0.507218
H  -7.847297 -1.370869 0.535859
H  -7.468088 -0.049969 1.65288
H  -8.941882 -0.000433 0.692917
elementType: S P O N C H
totalener: -1825.71297427 hartree
nucrepener: 2424.72381370 hartree
electener: -4250.43678798 hartree
oneelecener: -7326.16764040 hartree
twoeener: 3075.73085242 hartree
cpcmener: -0.03049227 hartree
kineticenergy: 1819.71897842 hartree
xcener: -138.288494731076 hartree
chargesum: 0.0000000
charge: -0.428117 0.738219 -0.307187 -0.334058 -0.340701 -0.277413 -0.466255 0.155785 -0.342379 -0.356301 0.183698 -0.115394 0.082791 0.183191 0.282191 -0.297034 -0.262214 0.474320 0.045158 0.038868 0.034366 -0.236763 -0.237365 -0.252415 0.150524 0.152540 0.097401 0.109009 0.106894 0.107819 0.085625 0.095299 0.111274 0.095458 0.108032 0.091266 0.085307 0.090517 0.098603 0.093253 0.077569 0.088913 0.091937 0.097768
qa: -0.4281 0.7382 -0.3072 -0.3341 -0.3407 -0.2774 -0.4663 0.1558 -0.3424 -0.3563 0.1837 -0.1154 0.0828 0.1832 0.2822 -0.2970 -0.2622 0.4743 0.0452 0.0389 0.0344 -0.2368 -0.2374 -0.2524 0.1505 0.1525 0.0974 0.1090 0.1069 0.1078 0.0856 0.0953 0.1113 0.0955 0.1080 0.0913 0.0853 0.0905 0.0986 0.0933 0.0776 0.0889 0.0919 0.0978
va: 1.9966 5.5133 2.1730 2.1268 2.1039 2.1531 2.0381 3.4317 3.1396 2.8032 4.1516 3.7142 4.0413 3.8541 4.1783 3.9597 3.9238 4.1268 3.8306 3.8424 3.8361 3.9403 3.9145 3.9213 1.0323 1.0131 1.0232 1.0013 1.0031 0.9961 1.0130 1.0084 0.9913 1.0103 0.9966 1.0083 1.0061 1.0035 1.0091 1.0060 1.0154 1.0034 1.0128 1.0068
dispcorr: -0.019804266 hartree
energy: -1825.732778538997
dipole: -2.54828 1.85340 -0.69487 -4.79873 3.93292 -0.86581 0.97494 -1.17037 -0.19543
magnitude: 1.12724 au
magnitude: 2.86522 debye
