program: Orca
programVersion: 5.0.2
elementType: S P O O O O O N N N C C C C C C C C C C C C C C H H H H H H H H H H H H H H H H H H H H
charge: 0
multiplicity: 1
keywords: wb97x-d3
keywords: def2-TZVPP
keywords: def2/J RIJCOSX
keywords: DEFGRID2
keywords: scfconv7
keywords: smallprint printgap noloewdin
keywords: NOSOSCF
formula: C14H20N3O5PS
InChI: InChI=1/C14H20N3O5PS/c1-5-19-14(18)11-9-17-12(15-10(11)4)8-13(16-17)22-23(24,20-6-2)21-7-3/h8-9H,5-7H2,1-4H3
44 atoms
S  3.311556 1.367899 -1.173479
P  3.373188 -0.032211 0.131011
O  2.055408 -0.98935 0.199205
O  3.501744 0.379399 1.658468
O  4.491324 -1.145639 -0.016705
O  -5.880625 -0.045418 -0.450099
O  -4.981312 -2.013777 -0.971207
N  -1.265464 -0.680093 -0.089703
N  -2.108823 1.375955 0.723691
N  -0.12739 -1.357958 -0.262005
C  -1.074392 0.564282 0.484203
C  -3.563015 -0.29569 -0.177582
C  -2.486671 -1.110319 -0.410521
C  -3.321854 0.994155 0.413924
C  0.786677 -0.540001 0.214293
C  0.28447 0.674752 0.699549
C  -4.398158 1.982838 0.730573
C  -4.869785 -0.877035 -0.572816
C  4.257941 1.534199 2.084128
C  4.899346 -1.666842 -1.302459
C  -7.196873 -0.51153 -0.79725
C  5.745612 1.354364 1.912541
C  6.181963 -1.021401 -1.756492
C  -8.158018 0.624138 -0.558478
H  -2.557381 -2.096583 -0.847417
H  0.810228 1.505307 1.138231
H  -5.141577 1.572347 1.413285
H  -3.945195 2.853107 1.200048
H  -4.924124 2.312263 -0.165125
H  3.998885 1.656623 3.134266
H  3.901288 2.414051 1.544838
H  4.107266 -1.530316 -2.040592
H  5.028024 -2.737598 -1.152489
H  -7.208883 -0.822645 -1.843648
H  -7.451352 -1.37701 -0.182358
H  6.040239 1.306978 0.863306
H  6.105197 0.458583 2.418679
H  6.253428 2.213482 2.352758
H  6.977026 -1.151418 -1.022872
H  6.050043 0.043166 -1.946088
H  6.505608 -1.489807 -2.686908
H  -9.165434 0.296004 -0.815104
H  -8.165977 0.933938 0.486921
H  -7.923297 1.490398 -1.177553
elementType: S P O N C H
totalener: -1825.71313646 hartree
nucrepener: 2427.59200313 hartree
electener: -4253.30513959 hartree
oneelecener: -7331.91175516 hartree
twoeener: 3078.60661557 hartree
cpcmener: -0.03075625 hartree
kineticenergy: 1819.70936115 hartree
xcener: -138.286948609564 hartree
chargesum: 0.0000000
charge: -0.427388 0.746814 -0.309566 -0.343072 -0.339816 -0.269859 -0.467852 0.156848 -0.341584 -0.354345 0.194450 -0.119738 0.089256 0.187327 0.276258 -0.307304 -0.261564 0.475590 0.035604 0.048122 0.030222 -0.236086 -0.244698 -0.258468 0.150254 0.156167 0.107543 0.098492 0.106747 0.111235 0.095402 0.092326 0.106576 0.099761 0.100862 0.077143 0.094143 0.098946 0.090861 0.078832 0.099906 0.096516 0.089151 0.089990
qa: -0.4274 0.7468 -0.3096 -0.3431 -0.3398 -0.2699 -0.4679 0.1568 -0.3416 -0.3543 0.1944 -0.1197 0.0893 0.1873 0.2763 -0.3073 -0.2616 0.4756 0.0356 0.0481 0.0302 -0.2361 -0.2447 -0.2585 0.1503 0.1562 0.1075 0.0985 0.1067 0.1112 0.0954 0.0923 0.1066 0.0998 0.1009 0.0771 0.0941 0.0989 0.0909 0.0788 0.0999 0.0965 0.0892 0.0900
va: 1.9906 5.5024 2.1691 2.1074 2.1120 2.1580 2.0455 3.4303 3.1415 2.7999 4.1244 3.7164 4.0347 3.8436 4.1827 3.9529 3.9210 4.1215 3.8489 3.8502 3.8487 3.9172 3.9170 3.9661 1.0340 1.0108 1.0018 1.0243 1.0019 0.9913 1.0081 1.0075 0.9964 0.9955 0.9963 1.0113 1.0058 1.0098 1.0024 1.0167 1.0099 1.0072 1.0024 1.0025
dispcorr: -0.020059835 hartree
energy: -1825.733196298243
dipole: -3.45670 2.77027 -0.68644 7.24881 -6.49622 0.75259 1.00666 -0.45521 0.55144
magnitude: 1.15831 au
magnitude: 2.94418 debye
