program: Orca
programVersion: 5.0.2
elementType: S P O O O O O N N N C C C C C C C C C C C C C C H H H H H H H H H H H H H H H H H H H H
charge: 0
multiplicity: 1
keywords: wb97x-d3
keywords: def2-TZVPP
keywords: def2/J RIJCOSX
keywords: DEFGRID2
keywords: scfconv7
keywords: smallprint printgap noloewdin
keywords: NOSOSCF
formula: C14H20N3O5PS
InChI: InChI=1/C14H20N3O5PS/c1-5-19-14(18)11-9-17-12(15-10(11)4)8-13(16-17)22-23(24,20-6-2)21-7-3/h8-9H,5-7H2,1-4H3
44 atoms
S  3.467633 -0.614461 -2.156172
P  3.337812 0.10213 -0.390324
O  1.925912 0.810687 0.010874
O  4.33266 1.303766 -0.135984
O  3.456711 -0.915791 0.828902
O  -5.171779 1.208423 0.251314
O  -5.938428 -0.880254 0.125421
N  -1.354802 0.16248 0.017914
N  -1.883709 -2.117238 -0.337235
N  -0.318656 0.999975 0.115543
C  -0.973248 -1.147359 -0.207652
C  -3.593056 -0.475844 -0.001115
C  -2.641285 0.502144 0.121379
C  -3.155016 -1.824409 -0.242147
C  0.723279 0.213027 -0.046653
C  0.405851 -1.136896 -0.251203
C  -4.096919 -2.970953 -0.410951
C  -5.018332 -0.099271 0.127205
C  4.456931 2.016646 1.120413
C  4.327013 -2.065109 0.810019
C  -6.501467 1.731503 0.408322
C  3.878795 3.402889 0.99698
C  5.780949 -1.688029 0.947654
C  -6.385394 3.227119 0.552805
H  -2.846437 1.547482 0.300982
H  1.055432 -1.979332 -0.413392
H  -3.522289 -3.871012 -0.617017
H  -4.693539 -3.139149 0.485154
H  -4.790958 -2.806313 -1.234778
H  5.525589 2.054245 1.328738
H  3.984172 1.461703 1.932394
H  4.150371 -2.634905 -0.104568
H  3.999813 -2.671822 1.652728
H  -7.102778 1.468038 -0.464202
H  -6.968831 1.287955 1.289755
H  2.802709 3.383519 0.827257
H  4.350854 3.962544 0.189346
H  4.059707 3.944376 1.926442
H  5.955258 -1.078634 1.834985
H  6.15284 -1.150824 0.074231
H  6.373211 -2.598588 1.047174
H  -5.803025 3.504388 1.431975
H  -5.929572 3.683907 -0.326216
H  -7.382654 3.651883 0.668544
elementType: S P O N C H
totalener: -1825.71456692 hartree
nucrepener: 2440.39318101 hartree
electener: -4266.10774793 hartree
oneelecener: -7357.17640814 hartree
twoeener: 3091.06866021 hartree
cpcmener: -0.03199119 hartree
kineticenergy: 1819.70825839 hartree
xcener: -138.286759055612 hartree
chargesum: -0.0000000
charge: -0.411376 0.698776 -0.300250 -0.338315 -0.330541 -0.282786 -0.456154 0.162470 -0.340755 -0.369760 0.167716 -0.121831 0.072983 0.192599 0.295168 -0.276982 -0.253482 0.480310 0.040415 0.037350 0.035085 -0.242210 -0.245183 -0.254428 0.158945 0.146048 0.095781 0.103759 0.105345 0.107499 0.102683 0.095813 0.110587 0.098476 0.098241 0.084443 0.088623 0.093557 0.091070 0.086525 0.104047 0.088272 0.088879 0.092588
qa: -0.4114 0.6988 -0.3002 -0.3383 -0.3305 -0.2828 -0.4562 0.1625 -0.3408 -0.3698 0.1677 -0.1218 0.0730 0.1926 0.2952 -0.2770 -0.2535 0.4803 0.0404 0.0373 0.0351 -0.2422 -0.2452 -0.2544 0.1589 0.1460 0.0958 0.1038 0.1053 0.1075 0.1027 0.0958 0.1106 0.0985 0.0982 0.0844 0.0886 0.0936 0.0911 0.0865 0.1040 0.0883 0.0889 0.0926
va: 2.0324 5.5364 2.1687 2.1182 2.0618 2.1277 2.0570 3.4153 3.1407 2.7948 4.1939 3.7453 4.0422 3.8691 4.1523 3.9776 3.9136 4.1119 3.8328 3.8390 3.8464 3.9505 3.9152 3.9677 1.0241 1.0189 1.0217 1.0048 1.0036 0.9919 1.0015 1.0105 0.9905 0.9953 0.9961 1.0128 1.0040 1.0068 1.0046 1.0139 1.0098 1.0030 1.0029 1.0069
dispcorr: -0.019920530 hartree
energy: -1825.734487451994
dipole: -3.14431 3.04635 -0.09796 7.52403 -6.58170 0.94233 11.89478 -9.65640 2.23838
magnitude: 2.43062 au
magnitude: 6.17816 debye
