program: Orca
programVersion: 5.0.2
elementType: S P O O O O O N N N C C C C C C C C C C C C C C H H H H H H H H H H H H H H H H H H H H
charge: 0
multiplicity: 1
keywords: wb97x-d3
keywords: def2-TZVPP
keywords: def2/J RIJCOSX
keywords: DEFGRID2
keywords: scfconv7
keywords: smallprint printgap noloewdin
keywords: NOSOSCF
formula: C14H20N3O5PS
InChI: InChI=1/C14H20N3O5PS/c1-5-19-14(18)11-9-17-12(15-10(11)4)8-13(16-17)22-23(24,20-6-2)21-7-3/h8-9H,5-7H2,1-4H3
44 atoms
S  4.759384 1.424675 -0.974792
P  3.421192 0.211484 -0.352151
O  1.972674 0.541438 -1.015944
O  3.154965 0.155169 1.214936
O  3.564341 -1.322121 -0.732003
O  -5.109962 1.127129 -0.383657
O  -5.821807 -0.77491 0.531175
N  -1.279242 0.06049 -0.368569
N  -1.747814 -2.00851 0.683876
N  -0.267526 0.795765 -0.838124
C  -0.867081 -1.147332 0.165493
C  -3.491436 -0.460784 0.141336
C  -2.569716 0.406006 -0.385292
C  -3.020077 -1.706423 0.686388
C  0.788453 0.044514 -0.60584
C  0.503833 -1.178364 0.015862
C  -3.925013 -2.731304 1.287723
C  -4.922316 -0.079262 0.12702
C  3.26732 1.311878 2.069723
C  4.836779 -2.000895 -0.776104
C  -6.456408 1.626426 -0.464396
C  2.130046 2.285736 1.882583
C  5.435353 -2.211238 0.592615
C  -6.401718 2.994044 -1.095578
H  -2.802026 1.366243 -0.823129
H  1.169831 -1.971568 0.307791
H  -3.324152 -3.566879 1.639408
H  -4.488394 -2.330765 2.130138
H  -4.64875 -3.105976 0.564306
H  4.231867 1.793717 1.896444
H  3.271528 0.906966 3.080118
H  5.516286 -1.442221 -1.423188
H  4.621219 -2.952324 -1.258516
H  -7.064392 0.944781 -1.062622
H  -6.88773 1.675426 0.537454
H  1.160973 1.802865 2.010283
H  2.15567 2.771766 0.906657
H  2.212752 3.068911 2.636994
H  4.738373 -2.713849 1.263587
H  5.754355 -1.276034 1.053322
H  6.318169 -2.843475 0.49392
H  -7.413818 3.393897 -1.161838
H  -5.80756 3.690528 -0.503156
H  -5.99305 2.957374 -2.105894
elementType: S P O N C H
totalener: -1825.71395732 hartree
nucrepener: 2463.59842382 hartree
electener: -4289.31238114 hartree
oneelecener: -7403.44036830 hartree
twoeener: 3114.12798716 hartree
cpcmener: -0.03034078 hartree
kineticenergy: 1819.70193376 hartree
xcener: -138.286626350388 hartree
chargesum: -0.0000000
charge: -0.410210 0.695273 -0.302359 -0.322807 -0.319998 -0.283674 -0.455703 0.169011 -0.340671 -0.353524 0.177955 -0.119072 0.070813 0.191538 0.222278 -0.264966 -0.252702 0.480491 0.032342 0.017384 0.034289 -0.242521 -0.234585 -0.253434 0.160335 0.162014 0.095902 0.104765 0.103951 0.097752 0.110352 0.097070 0.108300 0.098055 0.098810 0.088831 0.088123 0.108060 0.092655 0.081375 0.099349 0.092111 0.088478 0.088564
qa: -0.4102 0.6953 -0.3024 -0.3228 -0.3200 -0.2837 -0.4557 0.1690 -0.3407 -0.3535 0.1780 -0.1191 0.0708 0.1915 0.2223 -0.2650 -0.2527 0.4805 0.0323 0.0174 0.0343 -0.2425 -0.2346 -0.2534 0.1603 0.1620 0.0959 0.1048 0.1040 0.0978 0.1104 0.0971 0.1083 0.0981 0.0988 0.0888 0.0881 0.1081 0.0927 0.0814 0.0993 0.0921 0.0885 0.0886
va: 2.0479 5.5146 2.1482 2.0615 2.1129 2.1286 2.0574 3.4013 3.1399 2.7839 4.1451 3.7451 4.0432 3.8714 4.2199 3.9380 3.9122 4.1094 3.8405 3.8631 3.8465 3.8927 3.8919 3.9683 1.0238 1.0153 1.0217 1.0040 1.0044 1.0116 0.9918 1.0097 0.9918 0.9959 0.9953 1.0066 1.0164 1.0102 1.0048 1.0155 1.0093 1.0069 1.0028 1.0029
dispcorr: -0.020529124 hartree
energy: -1825.734486442063
dipole: -9.72746 8.81630 -0.91117 1.80885 -1.76964 0.03920 9.96602 -8.87124 1.09478
magnitude: 1.42488 au
magnitude: 3.62177 debye
