program: Orca
programVersion: 5.0.2
elementType: S P O O O O O N N N C C C C C C C C C C C C C C H H H H H H H H H H H H H H H H H H H H
charge: 0
multiplicity: 1
keywords: wb97x-d3
keywords: def2-TZVPP
keywords: def2/J RIJCOSX
keywords: DEFGRID2
keywords: scfconv7
keywords: smallprint printgap noloewdin
keywords: NOSOSCF
formula: C14H20N3O5PS
InChI: InChI=1/C14H20N3O5PS/c1-5-19-14(18)11-9-17-12(15-10(11)4)8-13(16-17)22-23(24,20-6-2)21-7-3/h8-9H,5-7H2,1-4H3
44 atoms
S  3.313764 -0.237366 -2.210138
P  3.357518 0.145159 -0.339061
O  1.995091 0.760324 0.311793
O  4.388597 1.281586 0.042325
O  3.583722 -1.080171 0.65424
O  -5.1020 1.372463 -0.220495
O  -5.909456 -0.695609 0.011035
N  -1.304058 0.219878 0.083632
N  -1.877873 -2.059764 -0.199433
N  -0.2499 1.030918 0.216941
C  -0.948646 -1.110286 -0.049536
C  -3.554319 -0.355329 -0.078869
C  -2.584488 0.601122 0.067025
C  -3.142533 -1.726906 -0.213571
C  0.775285 0.206608 0.17432
C  0.429875 -1.141392 0.0112
C  -4.10635 -2.85211 -0.402147
C  -4.975193 0.061498 -0.088949
C  4.607055 1.776048 1.388454
C  4.444105 -2.191312 0.333108
C  -6.421763 1.943917 -0.230734
C  4.010848 3.150449 1.553276
C  5.903322 -1.810867 0.328474
C  -6.988506 2.11708 1.158551
H  -2.770031 1.659616 0.177976
H  1.063135 -2.008957 -0.050713
H  -4.737708 -2.991559 0.474811
H  -4.76594 -2.68354 -1.252584
H  -3.547173 -3.769238 -0.572668
H  5.688443 1.802354 1.513665
H  4.206878 1.080805 2.127916
H  4.140192 -2.611034 -0.627547
H  4.236297 -2.929777 1.105235
H  -6.289257 2.911539 -0.712405
H  -7.081752 1.345315 -0.860173
H  2.923742 3.13737 1.486871
H  4.398454 3.846004 0.808991
H  4.279293 3.534947 2.538239
H  6.196819 -1.336492 1.265332
H  6.154079 -1.143614 -0.496867
H  6.501809 -2.714866 0.211295
H  -7.171109 1.165809 1.65652
H  -6.330468 2.719161 1.785245
H  -7.94316 2.639189 1.083969
elementType: S P O N C H
totalener: -1825.71366480 hartree
nucrepener: 2443.22822049 hartree
electener: -4268.94188530 hartree
oneelecener: -7363.00589249 hartree
twoeener: 3094.06400719 hartree
cpcmener: -0.03199820 hartree
kineticenergy: 1819.69441487 hartree
xcener: -138.284429617414 hartree
chargesum: 0.0000000
charge: -0.411654 0.704847 -0.304491 -0.338534 -0.334081 -0.288053 -0.456318 0.162977 -0.340244 -0.365650 0.193947 -0.122280 0.071999 0.189371 0.276334 -0.304213 -0.255982 0.482827 0.041342 0.034996 0.040654 -0.243760 -0.244006 -0.253646 0.158191 0.159188 0.105049 0.105623 0.095753 0.107391 0.102607 0.096232 0.111591 0.108382 0.090477 0.084655 0.088183 0.094302 0.091409 0.086236 0.103296 0.091404 0.087783 0.095866
qa: -0.4117 0.7048 -0.3045 -0.3385 -0.3341 -0.2881 -0.4563 0.1630 -0.3402 -0.3657 0.1939 -0.1223 0.0720 0.1894 0.2763 -0.3042 -0.2560 0.4828 0.0413 0.0350 0.0407 -0.2438 -0.2440 -0.2536 0.1582 0.1592 0.1050 0.1056 0.0958 0.1074 0.1026 0.0962 0.1116 0.1084 0.0905 0.0847 0.0882 0.0943 0.0914 0.0862 0.1033 0.0914 0.0878 0.0959
va: 2.0326 5.5263 2.1561 2.1129 2.0637 2.1287 2.0487 3.4119 3.1416 2.7902 4.1380 3.7391 4.0466 3.8695 4.1727 3.9593 3.9146 4.1168 3.8336 3.8342 3.8398 3.9503 3.9153 3.9186 1.0267 1.0092 1.0052 1.0032 1.0215 0.9919 1.0015 1.0104 0.9907 0.9958 1.0105 1.0121 1.0041 1.0068 1.0043 1.0152 1.0099 1.0125 1.0045 1.0067
dispcorr: -0.020209883 hartree
energy: -1825.733874685259
dipole: -3.63007 3.61601 -0.01406 3.35004 -2.79347 0.55658 11.70335 -9.78995 1.91340
magnitude: 1.99276 au
magnitude: 5.06519 debye
