program: Orca
programVersion: 5.0.2
elementType: S P O O O O O N N N C C C C C C C C C C C C C C H H H H H H H H H H H H H H H H H H H H
charge: 0
multiplicity: 1
keywords: wb97x-d3
keywords: def2-TZVPP
keywords: def2/J RIJCOSX
keywords: DEFGRID2
keywords: scfconv7
keywords: smallprint printgap noloewdin
keywords: NOSOSCF
formula: C14H20N3O5PS
InChI: InChI=1/C14H20N3O5PS/c1-5-19-14(18)11-9-17-12(15-10(11)4)8-13(16-17)22-23(24,20-6-2)21-7-3/h8-9H,5-7H2,1-4H3
44 atoms
S  2.617655 1.039955 -1.459089
P  3.157724 0.215223 0.183343
O  1.962821 -0.0048 1.272148
O  4.208485 0.972206 1.099326
O  3.763181 -1.250056 0.111574
O  -4.837896 1.403595 -0.437602
O  -5.852426 -0.578853 -0.585444
N  -1.288062 -0.151933 0.435882
N  -1.990837 -2.336701 -0.148942
N  -0.216154 0.540826 0.82676
C  -1.02631 -1.49741 0.241564
C  -3.505389 -0.482916 -0.188393
C  -2.504846 0.35717 0.2187
C  -3.197173 -1.878482 -0.359048
C  0.726292 -0.374119 0.876619
C  0.31299 -1.662965 0.529942
C  -4.207155 -2.887814 -0.795969
C  -4.855338 0.080244 -0.422176
C  4.08539 2.388995 1.363701
C  4.600276 -1.688733 -0.980129
C  -6.079059 2.112796 -0.591233
C  5.085933 3.165562 0.548885
C  5.956256 -1.02737 -0.976473
C  -6.840768 2.214176 0.709031
H  -2.61536 1.418726 0.387285
H  0.893048 -2.569633 0.501871
H  -4.658932 -2.621664 -1.751393
H  -3.717041 -3.852893 -0.901216
H  -5.016023 -2.988201 -0.07299
H  4.264747 2.505921 2.431707
H  3.06845 2.731889 1.163042
H  4.078019 -1.516613 -1.922994
H  4.691008 -2.763888 -0.838763
H  -5.781569 3.100046 -0.939521
H  -6.680485 1.650239 -1.374269
H  5.003484 4.224214 0.797037
H  4.902091 3.055904 -0.519636
H  6.107324 2.850983 0.76264
H  6.470513 -1.166618 -0.025649
H  5.897498 0.040537 -1.189845
H  6.568516 -1.481255 -1.756383
H  -7.186753 1.244918 1.065693
H  -6.235943 2.677505 1.488885
H  -7.718841 2.842423 0.554587
elementType: S P O N C H
totalener: -1825.71285253 hartree
nucrepener: 2453.39146053 hartree
electener: -4279.10431307 hartree
oneelecener: -7383.76128106 hartree
twoeener: 3104.65696799 hartree
cpcmener: -0.02952295 hartree
kineticenergy: 1819.73326243 hartree
xcener: -138.288926843451 hartree
chargesum: 0.0000000
charge: -0.431871 0.747404 -0.330007 -0.339409 -0.341602 -0.287938 -0.455351 0.169829 -0.342853 -0.351762 0.221291 -0.123167 0.073473 0.188276 0.240324 -0.304898 -0.253709 0.483030 0.052096 0.028236 0.040558 -0.241763 -0.232406 -0.253081 0.158473 0.170211 0.105926 0.096246 0.104126 0.106441 0.088792 0.095863 0.110223 0.107768 0.091285 0.097606 0.077476 0.090894 0.092722 0.077256 0.099130 0.090772 0.088059 0.096032
qa: -0.4319 0.7474 -0.3300 -0.3394 -0.3416 -0.2879 -0.4554 0.1698 -0.3429 -0.3518 0.2213 -0.1232 0.0735 0.1883 0.2403 -0.3049 -0.2537 0.4830 0.0521 0.0282 0.0406 -0.2418 -0.2324 -0.2531 0.1585 0.1702 0.1059 0.0962 0.1041 0.1064 0.0888 0.0959 0.1102 0.1078 0.0913 0.0976 0.0775 0.0909 0.0927 0.0773 0.0991 0.0908 0.0881 0.0960
va: 1.9905 5.5004 2.1467 2.1037 2.1223 2.1294 2.0502 3.3899 3.1307 2.7912 4.0171 3.7383 4.0475 3.8709 4.1793 3.9354 3.9154 4.1190 3.8531 3.8620 3.8403 3.9263 3.8998 3.9209 1.0266 1.0000 1.0031 1.0216 1.0057 0.9962 1.0089 1.0096 0.9918 0.9959 1.0106 1.0099 1.0165 1.0027 1.0062 1.0135 1.0093 1.0121 1.0045 1.0066
dispcorr: -0.019949340 hartree
energy: -1825.732801874286
dipole: -0.04277 0.17238 0.12961 7.77668 -6.77424 1.00244 -1.99599 2.18571 0.18973
magnitude: 1.02844 au
magnitude: 2.61409 debye
