program: Orca
programVersion: 5.0.2
elementType: S P O O O O O N N N C C C C C C C C C C C C C C H H H H H H H H H H H H H H H H H H H H
charge: 0
multiplicity: 1
keywords: wb97x-d3
keywords: def2-TZVPP
keywords: def2/J RIJCOSX
keywords: DEFGRID2
keywords: scfconv7
keywords: smallprint printgap noloewdin
keywords: NOSOSCF
formula: C14H20N3O5PS
InChI: InChI=1/C14H20N3O5PS/c1-5-19-14(18)11-9-17-12(15-10(11)4)8-13(16-17)22-23(24,20-6-2)21-7-3/h8-9H,5-7H2,1-4H3
44 atoms
S  3.304875 0.725719 1.945418
P  3.275967 0.06903 0.14628
O  1.914224 0.380988 -0.698057
O  3.384422 -1.497843 -0.073426
O  4.348814 0.638234 -0.869467
O  -5.161446 0.971484 -1.228687
O  -6.03928 -0.432884 0.261196
N  -1.400239 0.116357 -0.305461
N  -2.044372 -1.386623 1.407168
N  -0.32264 0.633552 -0.901195
C  -1.086095 -0.783107 0.697541
C  -3.669839 -0.219017 0.095562
C  -2.669435 0.395064 -0.611801
C  -3.299898 -1.132695 1.1429
C  0.679282 0.051218 -0.276916
C  0.291588 -0.845584 0.728818
C  -4.29763 -1.843183 1.997597
C  -5.076601 0.076533 -0.258366
C  4.107134 -2.365456 0.824991
C  4.753796 2.024763 -0.900061
C  -6.464256 1.343126 -1.708065
C  5.601954 -2.198548 0.707933
C  6.258015 2.100653 -0.855735
C  -6.266473 2.345431 -2.816417
H  -2.824227 1.09967 -1.415859
H  0.896179 -1.447324 1.384861
H  -4.934401 -2.504659 1.410452
H  -3.767014 -2.441747 2.734542
H  -4.952178 -1.146971 2.52112
H  3.801538 -3.370927 0.540563
H  3.768964 -2.188672 1.847908
H  4.315566 2.567348 -0.05928
H  4.356732 2.452934 -1.821087
H  -6.988539 0.456546 -2.070888
H  -7.047246 1.771453 -0.890138
H  5.933853 -1.219808 1.056555
H  5.943327 -2.339892 -0.317579
H  6.090127 -2.949379 1.330582
H  6.713117 1.554627 -1.683397
H  6.649761 1.705545 0.082555
H  6.56576 3.143949 -0.93438
H  -7.239783 2.64989 -3.201385
H  -5.753043 3.240533 -2.463719
H  -5.698682 1.92189 -3.645612
elementType: S P O N C H
totalener: -1825.71457275 hartree
nucrepener: 2427.91143867 hartree
electener: -4253.62601142 hartree
oneelecener: -7332.41493495 hartree
twoeener: 3078.78892353 hartree
cpcmener: -0.03006376 hartree
kineticenergy: 1819.70180566 hartree
xcener: -138.285880553221 hartree
chargesum: 0.0000000
charge: -0.428099 0.740701 -0.307385 -0.340918 -0.335108 -0.282722 -0.455894 0.158298 -0.340360 -0.356794 0.174704 -0.122203 0.072909 0.191880 0.287036 -0.290312 -0.253390 0.480987 0.041793 0.044945 0.033918 -0.237902 -0.234646 -0.255711 0.158955 0.146603 0.103922 0.095943 0.104220 0.111065 0.095086 0.085887 0.106963 0.099137 0.098907 0.077289 0.093945 0.098541 0.090903 0.083422 0.093323 0.092213 0.089270 0.088680
qa: -0.4281 0.7407 -0.3074 -0.3409 -0.3351 -0.2827 -0.4559 0.1583 -0.3404 -0.3568 0.1747 -0.1222 0.0729 0.1919 0.2870 -0.2903 -0.2534 0.4810 0.0418 0.0449 0.0339 -0.2379 -0.2346 -0.2557 0.1590 0.1466 0.1039 0.0959 0.1042 0.1111 0.0951 0.0859 0.1070 0.0991 0.0989 0.0773 0.0939 0.0985 0.0909 0.0834 0.0933 0.0922 0.0893 0.0887
va: 1.9930 5.5092 2.1749 2.1028 2.1268 2.1272 2.0576 3.4217 3.1431 2.8023 4.1770 3.7467 4.0449 3.8704 4.1762 3.9680 3.9145 4.1127 3.8407 3.8334 3.8459 3.9185 3.9343 3.9673 1.0245 1.0157 1.0044 1.0213 1.0041 0.9913 1.0080 1.0148 0.9970 0.9957 0.9954 1.0143 1.0058 1.0093 1.0035 1.0071 1.0088 1.0072 1.0027 1.0028
dispcorr: -0.019356551 hartree
energy: -1825.733929297726
dipole: 2.31179 -2.11009 0.20171 2.31224 -1.98966 0.32258 -5.83497 4.63823 -1.19674
magnitude: 1.25575 au
magnitude: 3.19188 debye
