program: Orca
programVersion: 5.0.2
elementType: S P O O O O O N N N C C C C C C C C C C C C C C H H H H H H H H H H H H H H H H H H H H
charge: 0
multiplicity: 1
keywords: wb97x-d3
keywords: def2-TZVPP
keywords: def2/J RIJCOSX
keywords: DEFGRID2
keywords: scfconv7
keywords: smallprint printgap noloewdin
keywords: NOSOSCF
formula: C14H20N3O5PS
InChI: InChI=1/C14H20N3O5PS/c1-5-19-14(18)11-9-17-12(15-10(11)4)8-13(16-17)22-23(24,20-6-2)21-7-3/h8-9H,5-7H2,1-4H3
44 atoms
S  3.010303 0.644535 2.483833
P  3.259716 0.344584 0.612879
O  2.334458 -0.854722 -0.018838
O  4.679547 -0.140522 0.095004
O  2.943399 1.616646 -0.275654
O  -4.396683 0.747242 -1.897684
O  -5.689709 -0.063538 -0.270451
N  -1.005479 -0.456274 -0.19694
N  -2.161877 -1.78045 1.389453
N  0.224478 -0.152189 -0.618795
C  -1.012077 -1.364314 0.848032
C  -3.333826 -0.403933 -0.179607
C  -2.145774 0.012867 -0.71602
C  -3.296536 -1.331399 0.920918
C  0.997341 -0.875401 0.165081
C  0.313932 -1.651462 1.103082
C  -4.526002 -1.852557 1.589646
C  -4.600094 0.101687 -0.761036
C  5.555915 -0.986424 0.871085
C  3.129067 1.652355 -1.712923
C  -5.531334 1.288082 -2.598335
C  5.062577 -2.408143 0.97087
C  2.149667 2.637159 -2.292923
C  -5.98383 2.611931 -2.031025
H  -2.045377 0.706674 -1.538311
H  0.724042 -2.311689 1.847941
H  -5.184438 -2.36357 0.887113
H  -4.232855 -2.557279 2.364622
H  -5.104574 -1.052487 2.050077
H  5.693796 -0.54554 1.860128
H  6.509425 -0.941627 0.348549
H  2.97593 0.66258 -2.145928
H  4.157714 1.954777 -1.910814
H  -5.179148 1.41056 -3.621219
H  -6.342816 0.558931 -2.611369
H  4.15504 -2.491283 1.569418
H  5.830457 -3.009301 1.459303
H  4.876817 -2.84101 -0.011962
H  2.286714 3.635338 -1.877067
H  1.120473 2.323761 -2.121718
H  2.307383 2.699698 -3.369855
H  -6.779237 3.010228 -2.662742
H  -6.38051 2.519601 -1.02069
H  -5.172569 3.340459 -2.022787
elementType: S P O N C H
totalener: -1825.71354756 hartree
nucrepener: 2472.79736718 hartree
electener: -4298.51091474 hartree
oneelecener: -7422.39954475 hartree
twoeener: 3123.88863001 hartree
cpcmener: -0.03018938 hartree
kineticenergy: 1819.69744157 hartree
xcener: -138.281878392842 hartree
chargesum: -0.0000000
charge: -0.418371 0.713039 -0.334563 -0.325706 -0.337969 -0.287690 -0.455436 0.193690 -0.343003 -0.398739 0.219046 -0.129998 0.076590 0.188824 0.305594 -0.316329 -0.250223 0.482782 0.024410 0.011349 0.039073 -0.229958 -0.239372 -0.254498 0.160379 0.166415 0.105602 0.095386 0.104550 0.094587 0.108321 0.112895 0.114041 0.108508 0.091550 0.077449 0.099255 0.091150 0.090546 0.081101 0.089963 0.096320 0.091336 0.088107
qa: -0.4184 0.7130 -0.3346 -0.3257 -0.3380 -0.2877 -0.4554 0.1937 -0.3430 -0.3987 0.2190 -0.1300 0.0766 0.1888 0.3056 -0.3163 -0.2502 0.4828 0.0244 0.0113 0.0391 -0.2300 -0.2394 -0.2545 0.1604 0.1664 0.1056 0.0954 0.1046 0.0946 0.1083 0.1129 0.1140 0.1085 0.0915 0.0774 0.0993 0.0911 0.0905 0.0811 0.0900 0.0963 0.0913 0.0881
va: 2.0274 5.5242 2.0804 2.1036 2.1257 2.1297 2.0498 3.3666 3.1292 2.7764 4.0311 3.7576 4.0374 3.8717 4.0782 3.9453 3.9153 4.1178 3.8670 3.8422 3.8403 3.8852 3.9478 3.9177 1.0230 0.9997 1.0031 1.0218 1.0056 1.0086 0.9906 0.9947 0.9971 0.9959 1.0101 1.0159 1.0097 1.0064 1.0031 1.0142 1.0067 1.0064 1.0129 1.0045
dispcorr: -0.020327728 hartree
energy: -1825.733875287230
dipole: -7.94280 7.96396 0.02116 4.45081 -4.40594 0.04488 -12.89522 10.25776 -2.63746
magnitude: 2.63793 au
magnitude: 6.70508 debye
