program: Orca
programVersion: 5.0.2
elementType: S P O O O O O N N N C C C C C C C C C C C C C C H H H H H H H H H H H H H H H H H H H H
charge: 0
multiplicity: 1
keywords: wb97x-d3
keywords: def2-TZVPP
keywords: def2/J RIJCOSX
keywords: DEFGRID2
keywords: scfconv7
keywords: smallprint printgap noloewdin
keywords: NOSOSCF
formula: C14H20N3O5PS
InChI: InChI=1/C14H20N3O5PS/c1-5-19-14(18)11-9-17-12(15-10(11)4)8-13(16-17)22-23(24,20-6-2)21-7-3/h8-9H,5-7H2,1-4H3
44 atoms
S  5.018398 -0.760597 -0.012758
P  3.19178 -0.196396 0.085541
O  2.205633 -1.468189 -0.190571
O  2.709637 0.931461 -0.924194
O  2.645887 0.328253 1.478622
O  -4.282805 1.574817 0.40135
O  -5.744924 -0.087114 0.152738
N  -1.095306 -0.745572 -0.088567
N  -2.414388 -2.660856 -0.521739
N  0.174259 -0.34123 0.017917
C  -1.211866 -2.091804 -0.387015
C  -3.41337 -0.537732 -0.041205
C  -2.170752 0.026119 0.082374
C  -3.493208 -1.939262 -0.359037
C  0.860607 -1.438986 -0.213442
C  0.07881 -2.569963 -0.476794
C  -4.786985 -2.667168 -0.526786
C  -4.60618 0.311646 0.175256
C  3.180181 1.021281 -2.287052
C  3.434102 1.145246 2.371073
C  -5.344393 2.512756 0.654857
C  4.191577 2.130242 -2.421087
C  3.56584 2.569329 1.891425
C  -4.714153 3.857753 0.909031
H  -1.980054 1.063211 0.318267
H  0.403656 -3.573568 -0.692883
H  -4.576248 -3.702263 -0.785871
H  -5.380276 -2.653812 0.387003
H  -5.398485 -2.229964 -1.31573
H  2.293581 1.218524 -2.88916
H  3.598456 0.067176 -2.614618
H  4.412628 0.682501 2.514021
H  2.901927 1.10301 3.319694
H  -6.012614 2.550291 -0.207641
H  -5.923809 2.184351 1.519891
H  3.784107 3.08543 -2.087058
H  4.468971 2.235917 -3.470717
H  5.098675 1.916625 -1.855316
H  4.181915 2.651462 0.995443
H  4.04818 3.157096 2.673497
H  2.592746 3.017652 1.690441
H  -5.500936 4.585868 1.107061
H  -4.054702 3.837927 1.777093
H  -4.146856 4.208567 0.046373
elementType: S P O N C H
totalener: -1825.71277207 hartree
nucrepener: 2467.53170473 hartree
electener: -4293.24447680 hartree
oneelecener: -7411.63101471 hartree
twoeener: 3118.38653792 hartree
cpcmener: -0.03100264 hartree
kineticenergy: 1819.69633072 hartree
xcener: -138.284773689925 hartree
chargesum: 0.0000000
charge: -0.419292 0.693134 -0.310670 -0.320448 -0.313269 -0.284422 -0.456365 0.173167 -0.346664 -0.401505 0.216260 -0.131028 0.073770 0.195126 0.330193 -0.336111 -0.248073 0.475837 0.050557 0.022017 0.035543 -0.243333 -0.233271 -0.255038 0.161022 0.166129 0.095128 0.103841 0.103964 0.103942 0.092112 0.093085 0.108237 0.098463 0.098346 0.090553 0.100147 0.079913 0.077917 0.098721 0.092555 0.092275 0.088550 0.088985
qa: -0.4193 0.6931 -0.3107 -0.3204 -0.3133 -0.2844 -0.4564 0.1732 -0.3467 -0.4015 0.2163 -0.1310 0.0738 0.1951 0.3302 -0.3361 -0.2481 0.4758 0.0506 0.0220 0.0355 -0.2433 -0.2333 -0.2550 0.1610 0.1661 0.0951 0.1038 0.1040 0.1039 0.0921 0.0931 0.1082 0.0985 0.0983 0.0906 0.1001 0.0799 0.0779 0.0987 0.0926 0.0923 0.0885 0.0890
va: 2.0312 5.5345 2.1865 2.0670 2.1102 2.1279 2.0569 3.4120 3.1301 2.7409 4.0206 3.7548 4.0346 3.8660 4.0618 3.8930 3.9159 4.1143 3.8378 3.8714 3.8452 3.9248 3.8963 3.9676 1.0219 1.0007 1.0220 1.0047 1.0042 0.9969 1.0083 1.0101 0.9911 0.9955 0.9962 1.0026 1.0109 1.0154 1.0104 1.0102 1.0055 1.0069 1.0027 1.0030
dispcorr: -0.019583722 hartree
energy: -1825.732355789162
dipole: -7.68126 6.62198 -1.05928 24.45885 -21.79576 2.66309 0.26473 -0.23710 0.02763
magnitude: 2.86616 au
magnitude: 7.28521 debye
