program: Orca
programVersion: 5.0.2
elementType: S P O O O O O N N N C C C C C C C C C C C C C C H H H H H H H H H H H H H H H H H H H H
charge: 0
multiplicity: 1
keywords: wb97x-d3
keywords: def2-TZVPP
keywords: def2/J RIJCOSX
keywords: DEFGRID2
keywords: scfconv7
keywords: smallprint printgap noloewdin
keywords: NOSOSCF
formula: C14H20N3O5PS
InChI: InChI=1/C14H20N3O5PS/c1-5-19-14(18)11-9-17-12(15-10(11)4)8-13(16-17)22-23(24,20-6-2)21-7-3/h8-9H,5-7H2,1-4H3
44 atoms
S  4.757485 1.845688 0.162798
P  3.403702 0.523691 0.436732
O  1.961025 1.211302 0.747697
O  3.532073 -0.43018 1.698595
O  3.120833 -0.503993 -0.743394
O  -4.956061 1.071366 -0.999163
O  -5.738965 -0.906922 -0.326255
N  -1.253247 0.382727 0.265667
N  -1.799172 -1.792223 1.025052
N  -0.229178 1.233976 0.159483
C  -0.898821 -0.819899 0.849441
C  -3.443863 -0.370895 0.021572
C  -2.504094 0.611995 -0.144978
C  -3.034046 -1.605851 0.636988
C  0.776182 0.567541 0.687816
C  0.445682 -0.715965 1.141239
C  -3.964061 -2.750094 0.873693
C  -4.829046 -0.123087 -0.44176
C  4.787022 -0.992968 2.134818
C  3.268214 -0.179106 -2.140526
C  -6.237034 1.454128 -1.530004
C  5.320908 -2.046447 1.195841
C  2.151799 0.69371 -2.657778
C  -6.472831 0.885218 -2.909993
H  -2.689867 1.577792 -0.592013
H  1.067004 -1.456737 1.61332
H  -3.411008 -3.560033 1.343759
H  -4.790919 -2.471269 1.526242
H  -4.396585 -3.119403 -0.055709
H  4.568013 -1.419638 3.111837
H  5.509049 -0.185793 2.274239
H  3.27283 -1.143246 -2.645744
H  4.241623 0.289053 -2.299215
H  -7.031249 1.170012 -0.838309
H  -6.199134 2.541574 -1.564998
H  5.63847 -1.629513 0.239841
H  4.587507 -2.831573 1.011585
H  6.195032 -2.508778 1.655737
H  2.164686 1.6894 -2.213061
H  1.17418 0.243205 -2.485137
H  2.276797 0.815445 -3.734429
H  -6.527646 -0.203238 -2.907692
H  -7.423558 1.262747 -3.289089
H  -5.692121 1.193528 -3.606086
elementType: S P O N C H
totalener: -1825.71271466 hartree
nucrepener: 2471.43261967 hartree
electener: -4297.14533434 hartree
oneelecener: -7419.18327840 hartree
twoeener: 3122.03794406 hartree
cpcmener: -0.02999031 hartree
kineticenergy: 1819.69559201 hartree
xcener: -138.285735180519 hartree
chargesum: -0.0000000
charge: -0.413678 0.699914 -0.308918 -0.319542 -0.322333 -0.287638 -0.456705 0.173737 -0.341501 -0.359978 0.196610 -0.132766 0.071215 0.190679 0.221338 -0.282076 -0.251730 0.491457 0.017627 0.034583 0.039953 -0.233473 -0.241626 -0.254728 0.159886 0.166548 0.095899 0.104110 0.103901 0.107789 0.096963 0.109909 0.097435 0.091140 0.107388 0.080750 0.092478 0.098826 0.086667 0.087864 0.107837 0.090676 0.095356 0.088155
qa: -0.4137 0.6999 -0.3089 -0.3195 -0.3223 -0.2876 -0.4567 0.1737 -0.3415 -0.3600 0.1966 -0.1328 0.0712 0.1907 0.2213 -0.2821 -0.2517 0.4915 0.0176 0.0346 0.0400 -0.2335 -0.2416 -0.2547 0.1599 0.1665 0.0959 0.1041 0.1039 0.1078 0.0970 0.1099 0.0974 0.0911 0.1074 0.0807 0.0925 0.0988 0.0867 0.0879 0.1078 0.0907 0.0954 0.0882
va: 2.0439 5.5154 2.1409 2.1152 2.0638 2.1283 2.0500 3.3921 3.1380 2.7779 4.0947 3.7451 4.0439 3.8732 4.2138 3.9243 3.9110 4.1155 3.8645 3.8391 3.8422 3.8909 3.8929 3.9191 1.0265 1.0105 1.0216 1.0044 1.0046 0.9914 1.0093 0.9915 1.0115 1.0103 0.9959 1.0147 1.0051 1.0094 1.0173 1.0075 1.0107 1.0129 1.0070 1.0042
dispcorr: -0.020880437 hartree
energy: -1825.733595100113
dipole: -10.01186 9.09124 -0.92063 -9.91977 9.04854 -0.87123 -13.20173 11.99468 -1.20705
magnitude: 1.75031 au
magnitude: 4.44892 debye
