program: Orca
programVersion: 5.0.2
elementType: S P O O O O O N N N C C C C C C C C C C C C C C H H H H H H H H H H H H H H H H H H H H
charge: 0
multiplicity: 1
keywords: wb97x-d3
keywords: def2-TZVPP
keywords: def2/J RIJCOSX
keywords: DEFGRID2
keywords: scfconv7
keywords: smallprint printgap noloewdin
keywords: NOSOSCF
formula: C14H20N3O5PS
InChI: InChI=1/C14H20N3O5PS/c1-5-19-14(18)11-9-17-12(15-10(11)4)8-13(16-17)22-23(24,20-6-2)21-7-3/h8-9H,5-7H2,1-4H3
44 atoms
S  3.441268 1.598294 1.267838
P  3.419912 0.062683 0.122846
O  2.063792 -0.152198 -0.756698
O  3.516689 -1.373577 0.78706
O  4.50452 -0.006186 -1.031429
O  -5.003599 0.292737 -1.612238
O  -5.908061 -0.064267 0.390575
N  -1.258209 -0.082081 -0.333265
N  -1.940203 -0.388682 1.912819
N  -0.16559 -0.000727 -1.099515
C  -0.96684 -0.294286 1.001689
C  -3.535484 -0.069709 0.156422
C  -2.519602 0.024994 -0.75888
C  -3.188342 -0.282173 1.53671
C  0.819606 -0.169131 -0.242958
C  0.40857 -0.3614 1.083287
C  -4.201554 -0.393211 2.628503
C  -4.934433 0.045609 -0.314506
C  4.385678 -1.681687 1.898221
C  5.054141 1.163839 -1.675454
C  -6.306265 0.427693 -2.2069
C  3.664969 -2.622543 2.82643
C  4.080412 1.815854 -2.624564
C  -6.112757 0.697353 -3.676322
H  -2.65361 0.184673 -1.818997
H  0.99786 -0.520066 1.969441
H  -4.866884 -1.242925 2.478626
H  -3.682628 -0.524739 3.575294
H  -4.82431 0.498107 2.695686
H  4.667527 -0.763651 2.418506
H  5.291571 -2.134649 1.493929
H  5.929999 0.795489 -2.207097
H  5.393952 1.866634 -0.912371
H  -6.876027 -0.490414 -2.049618
H  -6.844089 1.247323 -1.726187
H  3.366523 -3.540401 2.31937
H  2.778794 -2.157056 3.25834
H  4.331331 -2.895758 3.645125
H  3.230624 2.259783 -2.105137
H  3.70793 1.110675 -3.367586
H  4.594391 2.618936 -3.154446
H  -5.560817 1.621518 -3.849156
H  -5.589573 -0.120638 -4.17223
H  -7.089619 0.801386 -4.148613
elementType: S P O N C H
totalener: -1825.71467575 hartree
nucrepener: 2441.13106793 hartree
electener: -4266.84574368 hartree
oneelecener: -7358.94237457 hartree
twoeener: 3092.09663089 hartree
cpcmener: -0.02995180 hartree
kineticenergy: 1819.69473128 hartree
xcener: -138.284688559922 hartree
chargesum: -0.0000000
charge: -0.428722 0.742337 -0.303587 -0.335411 -0.342895 -0.283829 -0.456677 0.156337 -0.340697 -0.358888 0.172492 -0.120547 0.072064 0.193063 0.298094 -0.285597 -0.252574 0.480922 0.043123 0.029207 0.035368 -0.237812 -0.235355 -0.253853 0.159559 0.145442 0.104153 0.095801 0.103758 0.084947 0.109335 0.109281 0.095508 0.098561 0.097953 0.091367 0.085029 0.093224 0.080944 0.091312 0.098142 0.088491 0.088414 0.092218
qa: -0.4287 0.7423 -0.3036 -0.3354 -0.3429 -0.2838 -0.4567 0.1563 -0.3407 -0.3589 0.1725 -0.1205 0.0721 0.1931 0.2981 -0.2856 -0.2526 0.4809 0.0431 0.0292 0.0354 -0.2378 -0.2354 -0.2539 0.1596 0.1454 0.1042 0.0958 0.1038 0.0849 0.1093 0.1093 0.0955 0.0986 0.0980 0.0914 0.0850 0.0932 0.0809 0.0913 0.0981 0.0885 0.0884 0.0922
va: 1.9953 5.5080 2.1614 2.1178 2.1308 2.1289 2.0569 3.4253 3.1413 2.8023 4.1843 3.7467 4.0438 3.8679 4.1528 3.9769 3.9132 4.1091 3.8396 3.8601 3.8457 3.9393 3.8923 3.9684 1.0240 1.0179 1.0046 1.0217 1.0043 1.0126 0.9949 0.9920 1.0098 0.9960 0.9958 1.0040 1.0045 1.0086 1.0161 1.0064 1.0086 1.0031 1.0028 1.0069
dispcorr: -0.019339746 hartree
energy: -1825.734015499898
dipole: -6.26137 6.42839 0.16702 -1.61266 1.26207 -0.35059 -5.74765 4.57803 -1.16962
magnitude: 1.23240 au
magnitude: 3.13251 debye
