program: Orca
programVersion: 5.0.2
elementType: S P O O O O O N N N C C C C C C C C C C C C C C H H H H H H H H H H H H H H H H H H H H
charge: 0
multiplicity: 1
keywords: wb97x-d3
keywords: def2-TZVPP
keywords: def2/J RIJCOSX
keywords: DEFGRID2
keywords: scfconv7
keywords: smallprint printgap noloewdin
keywords: NOSOSCF
formula: C14H20N3O5PS
InChI: InChI=1/C14H20N3O5PS/c1-5-19-14(18)11-9-17-12(15-10(11)4)8-13(16-17)22-23(24,20-6-2)21-7-3/h8-9H,5-7H2,1-4H3
44 atoms
S  5.150298 0.142415 -0.2886
P  3.297136 0.459323 0.067892
O  2.406772 -0.66833 -0.720808
O  2.69026 1.866204 -0.340411
O  2.784548 0.405678 1.567465
O  -4.368842 1.29021 0.687836
O  -5.589305 -0.555179 0.422012
N  -0.934799 -0.478309 -0.240149
N  -2.027366 -2.440795 -0.987709
N  0.276533 0.079312 -0.134039
C  -0.901612 -1.7435 -0.800802
C  -3.251569 -0.610465 -0.047424
C  -2.085628 0.087259 0.13106
C  -3.174627 -1.922786 -0.632106
C  1.076853 -0.842033 -0.627584
C  0.42767 -2.003605 -1.062313
C  -4.376984 -2.771511 -0.888919
C  -4.526703 0.015231 0.371333
C  3.094779 2.57458 -1.530414
C  3.391025 -0.435762 2.571927
C  -5.5176 2.029198 1.13777
C  2.648438 1.897824 -2.803017
C  3.12198 -1.903716 2.352729
C  -5.080488 3.452078 1.373481
H  -2.014478 1.076853 0.558559
H  0.859206 -2.88875 -1.496986
H  -4.064355 -3.682302 -1.394583
H  -4.880965 -3.046749 0.037188
H  -5.10799 -2.26057 -1.514853
H  4.178088 2.710315 -1.514776
H  2.631154 3.554248 -1.430132
H  2.95106 -0.096795 3.508234
H  4.462932 -0.23255 2.610118
H  -6.302219 1.98333 0.379841
H  -5.904319 1.579527 2.054713
H  3.17265 0.958674 -2.981314
H  2.869968 2.557192 -3.643148
H  1.574783 1.708183 -2.802734
H  2.054373 -2.112302 2.278234
H  3.509961 -2.459103 3.207755
H  3.620102 -2.287947 1.462191
H  -5.935198 4.032908 1.721064
H  -4.303086 3.515765 2.13545
H  -4.712912 3.91775 0.458865
elementType: S P O N C H
totalener: -1825.71330261 hartree
nucrepener: 2492.88020692 hartree
electener: -4318.59350953 hartree
oneelecener: -7462.25070050 hartree
twoeener: 3143.65719097 hartree
cpcmener: -0.03092821 hartree
kineticenergy: 1819.69106652 hartree
xcener: -138.284758243150 hartree
chargesum: -0.0000000
charge: -0.419032 0.687764 -0.307771 -0.322634 -0.328035 -0.283896 -0.456672 0.175584 -0.346602 -0.387210 0.219221 -0.124687 0.073834 0.194107 0.310444 -0.324912 -0.252932 0.474533 0.023241 0.029093 0.036168 -0.246546 -0.247699 -0.254068 0.159596 0.165575 0.096581 0.104917 0.104603 0.097538 0.110428 0.111119 0.097555 0.096258 0.100468 0.086056 0.105454 0.089546 0.090370 0.106128 0.087003 0.092183 0.088389 0.088944
qa: -0.4190 0.6878 -0.3078 -0.3226 -0.3280 -0.2839 -0.4567 0.1756 -0.3466 -0.3872 0.2192 -0.1247 0.0738 0.1941 0.3104 -0.3249 -0.2529 0.4745 0.0232 0.0291 0.0362 -0.2465 -0.2477 -0.2541 0.1596 0.1656 0.0966 0.1049 0.1046 0.0975 0.1104 0.1111 0.0976 0.0963 0.1005 0.0861 0.1055 0.0895 0.0904 0.1061 0.0870 0.0922 0.0884 0.0889
va: 2.0276 5.5195 2.1117 2.1108 2.1095 2.1280 2.0556 3.4044 3.1294 2.7110 4.0142 3.7489 4.0394 3.8653 4.0419 3.9016 3.9170 4.1103 3.8645 3.8537 3.8456 3.8903 3.8882 3.9686 1.0226 1.0012 1.0217 1.0048 1.0036 1.0091 0.9912 0.9923 1.0097 0.9961 0.9955 1.0164 1.0091 1.0083 1.0054 1.0092 1.0173 1.0068 1.0026 1.0032
dispcorr: -0.020524571 hartree
energy: -1825.733827184463
dipole: -13.92239 12.41828 -1.50412 7.65886 -6.29865 1.36020 3.47704 -2.82658 0.65046
magnitude: 2.12970 au
magnitude: 5.41326 debye
