program: Orca
programVersion: 5.0.2
elementType: S P O O O O O N N N C C C C C C C C C C C C C C H H H H H H H H H H H H H H H H H H H H
charge: 0
multiplicity: 1
keywords: wb97x-d3
keywords: def2-TZVPP
keywords: def2/J RIJCOSX
keywords: DEFGRID2
keywords: scfconv7
keywords: smallprint printgap noloewdin
keywords: NOSOSCF
formula: C14H20N3O5PS
InChI: InChI=1/C14H20N3O5PS/c1-5-19-14(18)11-9-17-12(15-10(11)4)8-13(16-17)22-23(24,20-6-2)21-7-3/h8-9H,5-7H2,1-4H3
44 atoms
S  4.887946 0.864068 1.246135
P  3.325073 0.078052 0.475131
O  2.043297 0.191986 1.473394
O  3.335771 -1.484608 0.191987
O  2.80194 0.666397 -0.908441
O  -4.77478 1.46679 -0.299399
O  -5.627647 -0.506898 -0.897793
N  -1.188247 -0.018378 0.558306
N  -1.980253 -2.248242 0.460246
N  -0.093037 0.69945 0.815717
C  -0.987417 -1.381819 0.688173
C  -3.405433 -0.393082 -0.045755
C  -2.378765 0.476756 0.203915
C  -3.154636 -1.803086 0.098005
C  0.804676 -0.216102 1.11115
C  0.332992 -1.53143 1.059858
C  -4.200089 -2.843484 -0.137827
C  -4.717154 0.154452 -0.463431
C  4.52473 -2.190978 -0.21737
C  3.037308 2.026796 -1.32918
C  -5.969722 2.162307 -0.693391
C  4.940373 -1.864242 -1.630001
C  2.266342 3.04326 -0.523841
C  -6.011088 2.434019 -2.178835
H  -2.446108 1.552434 0.127884
H  0.861152 -2.446157 1.266612
H  -5.085076 -2.677893 0.476033
H  -4.526393 -2.855588 -1.177659
H  -3.786991 -3.820112 0.104257
H  4.263984 -3.243237 -0.120291
H  5.328873 -1.97772 0.490052
H  2.728439 2.045214 -2.373155
H  4.109659 2.229278 -1.29306
H  -6.85062 1.610708 -0.362464
H  -5.932774 3.095562 -0.134267
H  5.294871 -0.837623 -1.729859
H  4.125667 -2.024681 -2.336283
H  5.7632 -2.521208 -1.914002
H  1.195568 2.843014 -0.535838
H  2.429431 4.028587 -0.962604
H  2.60211 3.088658 0.51328
H  -6.074978 1.519683 -2.767968
H  -6.895395 3.032756 -2.40213
H  -5.137458 2.999023 -2.505497
elementType: S P O N C H
totalener: -1825.71142890 hartree
nucrepener: 2477.39767687 hartree
electener: -4303.10910576 hartree
oneelecener: -7431.33737252 hartree
twoeener: 3128.22826675 hartree
cpcmener: -0.02898259 hartree
kineticenergy: 1819.71151067 hartree
xcener: -138.287381364672 hartree
chargesum: 0.0000000
charge: -0.416497 0.714077 -0.324880 -0.327577 -0.333627 -0.287688 -0.455539 0.182583 -0.342702 -0.379123 0.212577 -0.126758 0.074865 0.188137 0.263419 -0.303971 -0.253193 0.484693 0.025578 0.039513 0.039417 -0.235396 -0.246265 -0.254006 0.159697 0.166251 0.104771 0.104749 0.096743 0.106806 0.095098 0.110868 0.095553 0.091471 0.108288 0.080585 0.091737 0.098249 0.088520 0.103284 0.084206 0.090961 0.096145 0.088382
qa: -0.4165 0.7141 -0.3249 -0.3276 -0.3336 -0.2877 -0.4555 0.1826 -0.3427 -0.3791 0.2126 -0.1268 0.0749 0.1881 0.2634 -0.3040 -0.2532 0.4847 0.0256 0.0395 0.0394 -0.2354 -0.2463 -0.2540 0.1597 0.1663 0.1048 0.1047 0.0967 0.1068 0.0951 0.1109 0.0956 0.0915 0.1083 0.0806 0.0917 0.0982 0.0885 0.1033 0.0842 0.0910 0.0961 0.0884
va: 2.0266 5.5047 2.1429 2.1210 2.0683 2.1292 2.0500 3.3778 3.1311 2.7751 4.0209 3.7464 4.0394 3.8711 4.1536 3.9220 3.9176 4.1164 3.8665 3.8376 3.8396 3.8903 3.8967 3.9203 1.0249 1.0032 1.0034 1.0054 1.0216 0.9913 1.0095 0.9912 1.0096 1.0104 0.9958 1.0154 1.0059 1.0093 1.0168 1.0111 1.0186 1.0124 1.0067 1.0043
dispcorr: -0.020566814 hartree
energy: -1825.731995710935
dipole: -10.27672 9.11756 -1.15916 5.38315 -4.68440 0.69875 -17.32978 15.66065 -1.66913
magnitude: 2.14893 au
magnitude: 5.46215 debye
