program: Orca
programVersion: 5.0.2
elementType: S P O O O O O N N N C C C C C C C C C C C C C C H H H H H H H H H H H H H H H H H H H H
charge: 0
multiplicity: 1
keywords: wb97x-d3
keywords: def2-TZVPP
keywords: def2/J RIJCOSX
keywords: DEFGRID2
keywords: scfconv7
keywords: smallprint printgap noloewdin
keywords: NOSOSCF
formula: C14H20N3O5PS
InChI: InChI=1/C14H20N3O5PS/c1-5-19-14(18)11-9-17-12(15-10(11)4)8-13(16-17)22-23(24,20-6-2)21-7-3/h8-9H,5-7H2,1-4H3
44 atoms
S  3.486792 -0.483936 -1.814879
P  3.287372 0.207142 -0.039453
O  2.102844 -0.455877 0.863148
O  2.919358 1.743483 0.116226
O  4.507431 0.032518 0.958878
O  -4.812526 1.388961 0.676831
O  -5.832998 -0.194414 -0.520614
N  -1.198555 -0.217883 0.276967
N  -1.994301 -1.903313 -1.186671
N  -0.083563 0.231979 0.856966
C  -0.984543 -1.323269 -0.529892
C  -3.471158 -0.280949 -0.22986
C  -2.422097 0.298645 0.432081
C  -3.204373 -1.425811 -1.061852
C  0.83793 -0.597109 0.414409
C  0.366179 -1.589091 -0.448726
C  -4.262355 -2.139655 -1.837973
C  -4.828863 0.285115 -0.054774
C  3.417025 2.751845 -0.787473
C  5.363069 -1.128045 0.960172
C  -6.060488 2.029625 0.990266
C  4.896741 2.999069 -0.62452
C  4.681908 -2.355896 1.514194
C  -6.756171 1.372618 2.15981
H  -2.500093 1.15548 1.085334
H  0.918441 -2.37661 -0.93083
H  -5.014963 -2.580543 -1.184538
H  -4.781964 -1.473041 -2.525893
H  -3.796665 -2.935953 -2.414355
H  2.843295 3.644279 -0.544803
H  3.175469 2.465211 -1.812865
H  6.210237 -0.841862 1.580726
H  5.732461 -1.303624 -0.052033
H  -5.782601 3.053325 1.234351
H  -6.700689 2.058835 0.108027
H  5.183656 3.840836 -1.255732
H  5.495187 2.141646 -0.935095
H  5.151707 3.250796 0.404993
H  4.266784 -2.173608 2.505528
H  5.42043 -3.153394 1.603443
H  3.887732 -2.720766 0.862284
H  -6.114291 1.347913 3.040847
H  -7.645371 1.951468 2.413545
H  -7.077496 0.35606 1.934224
elementType: S P O N C H
totalener: -1825.71254648 hartree
nucrepener: 2454.51696792 hartree
electener: -4280.22951440 hartree
oneelecener: -7385.97082305 hartree
twoeener: 3105.74130865 hartree
cpcmener: -0.02963253 hartree
kineticenergy: 1819.71925634 hartree
xcener: -138.288504901458 hartree
chargesum: -0.0000000
charge: -0.431487 0.743394 -0.328957 -0.341845 -0.336638 -0.288169 -0.455599 0.164477 -0.340926 -0.358285 0.219624 -0.131454 0.075633 0.188579 0.275362 -0.314037 -0.251303 0.488365 0.028730 0.034114 0.039460 -0.236708 -0.235640 -0.253803 0.159012 0.161220 0.104712 0.103546 0.096046 0.109186 0.095309 0.110446 0.093915 0.107314 0.091263 0.097982 0.079972 0.092097 0.092110 0.099139 0.079252 0.088081 0.095709 0.090804
qa: -0.4315 0.7434 -0.3290 -0.3418 -0.3366 -0.2882 -0.4556 0.1645 -0.3409 -0.3583 0.2196 -0.1315 0.0756 0.1886 0.2754 -0.3140 -0.2513 0.4884 0.0287 0.0341 0.0395 -0.2367 -0.2356 -0.2538 0.1590 0.1612 0.1047 0.1035 0.0960 0.1092 0.0953 0.1104 0.0939 0.1073 0.0913 0.0980 0.0800 0.0921 0.0921 0.0991 0.0793 0.0881 0.0957 0.0908
va: 1.9972 5.5101 2.1383 2.1289 2.1104 2.1278 2.0513 3.3934 3.1319 2.7970 4.0526 3.7464 4.0470 3.8713 4.1608 3.9435 3.9148 4.1171 3.8658 3.8526 3.8416 3.8959 3.9027 3.9206 1.0269 1.0067 1.0046 1.0042 1.0216 0.9922 1.0103 0.9915 1.0106 0.9957 1.0104 1.0088 1.0159 1.0063 1.0065 1.0093 1.0126 1.0043 1.0069 1.0121
dispcorr: -0.019828877 hartree
energy: -1825.732375356919
dipole: -4.10589 4.04195 -0.06393 5.34500 -4.03983 1.30517 5.43402 -4.45037 0.98366
magnitude: 1.63559 au
magnitude: 4.15733 debye
