program: Orca
programVersion: 5.0.2
elementType: S P O O O O O N N N C C C C C C C C C C C C C C H H H H H H H H H H H H H H H H H H H H
charge: 0
multiplicity: 1
keywords: wb97x-d3
keywords: def2-TZVPP
keywords: def2/J RIJCOSX
keywords: DEFGRID2
keywords: scfconv7
keywords: smallprint printgap noloewdin
keywords: NOSOSCF
formula: C14H20N3O5PS
InChI: InChI=1/C14H20N3O5PS/c1-5-19-14(18)11-9-17-12(15-10(11)4)8-13(16-17)22-23(24,20-6-2)21-7-3/h8-9H,5-7H2,1-4H3
44 atoms
S  2.93598 1.486447 1.344019
P  3.23975 0.026937 0.140884
O  1.964448 -0.378098 -0.794141
O  3.597416 -1.387865 0.764556
O  4.346405 0.192573 -0.982219
O  -5.063024 0.718244 -1.464038
O  -6.0193 -0.358796 0.235546
N  -1.360502 -0.250366 -0.381336
N  -2.0878 -1.122106 1.697055
N  -0.256287 -0.014825 -1.095711
C  -1.097674 -0.829923 0.847724
C  -3.641745 -0.275389 0.085686
C  -2.610477 0.024442 -0.764555
C  -3.324656 -0.867276 1.358118
C  0.70691 -0.457108 -0.316617
C  0.271977 -0.981704 0.906629
C  -4.359431 -1.213536 2.377794
C  -5.028615 0.011231 -0.346228
C  4.351377 -1.525918 1.988296
C  4.432933 1.387124 -1.794892
C  -6.348792 1.034706 -2.02536
C  5.806408 -1.171754 1.812216
C  5.555096 2.274638 -1.323985
C  -6.114594 1.826397 -3.285674
H  -2.724045 0.469382 -1.742564
H  0.849362 -1.406101 1.710164
H  -4.976408 -0.354369 2.639396
H  -5.02963 -1.995873 2.022443
H  -3.861568 -1.569214 3.276972
H  4.234042 -2.572041 2.265455
H  3.886817 -0.917646 2.766789
H  3.482322 1.924248 -1.792665
H  4.607132 1.034062 -2.810218
H  -6.892531 0.111938 -2.237511
H  -6.92959 1.61235 -1.303474
H  6.335056 -1.388928 2.741146
H  5.950196 -0.112329 1.596359
H  6.269858 -1.757551 1.018401
H  5.637209 3.130054 -1.995204
H  6.510457 1.750464 -1.333003
H  5.37198 2.653162 -0.319169
H  -5.586799 2.759154 -3.085033
H  -5.548562 1.255981 -4.022606
H  -7.077732 2.078914 -3.729494
elementType: S P O N C H
totalener: -1825.71422853 hartree
nucrepener: 2438.23147595 hartree
electener: -4263.94570448 hartree
oneelecener: -7353.16659105 hartree
twoeener: 3089.22088657 hartree
cpcmener: -0.03007630 hartree
kineticenergy: 1819.70712003 hartree
xcener: -138.285404808255 hartree
chargesum: -0.0000000
charge: -0.427740 0.750687 -0.315829 -0.343653 -0.340408 -0.283928 -0.455411 0.161576 -0.340833 -0.353049 0.215260 -0.116388 0.073292 0.191122 0.262635 -0.325556 -0.252856 0.476822 0.034388 0.045521 0.036920 -0.233620 -0.239747 -0.253967 0.158734 0.163922 0.104433 0.104439 0.096661 0.111734 0.095884 0.091689 0.107392 0.098807 0.097546 0.097858 0.077445 0.093071 0.097720 0.090140 0.077840 0.088825 0.088371 0.092252
qa: -0.4277 0.7507 -0.3158 -0.3437 -0.3404 -0.2839 -0.4554 0.1616 -0.3408 -0.3530 0.2153 -0.1164 0.0733 0.1911 0.2626 -0.3256 -0.2529 0.4768 0.0344 0.0455 0.0369 -0.2336 -0.2397 -0.2540 0.1587 0.1639 0.1044 0.1044 0.0967 0.1117 0.0959 0.0917 0.1074 0.0988 0.0975 0.0979 0.0774 0.0931 0.0977 0.0901 0.0778 0.0888 0.0884 0.0923
va: 1.9897 5.4957 2.1558 2.1122 2.1124 2.1291 2.0565 3.4104 3.1399 2.7915 4.0809 3.7445 4.0450 3.8692 4.1947 3.9481 3.9159 4.1105 3.8455 3.8611 3.8452 3.9196 3.9229 3.9688 1.0245 1.0050 1.0038 1.0048 1.0213 0.9913 1.0091 1.0053 0.9955 0.9964 0.9955 1.0092 1.0136 1.0057 1.0092 1.0030 1.0180 1.0031 1.0028 1.0068
dispcorr: -0.019640772 hartree
energy: -1825.733869304757
dipole: 1.62426 -1.43585 0.18841 5.85173 -5.57215 0.27958 -4.48103 3.40379 -1.07724
magnitude: 1.12876 au
magnitude: 2.86908 debye
