program: Orca
programVersion: 5.0.2
elementType: S P O O O O O N N N C C C C C C C C C C C C C C H H H H H H H H H H H H H H H H H H H H
charge: 0
multiplicity: 1
keywords: wb97x-d3
keywords: def2-TZVPP
keywords: def2/J RIJCOSX
keywords: DEFGRID2
keywords: scfconv7
keywords: smallprint printgap noloewdin
keywords: NOSOSCF
formula: C14H20N3O5PS
InChI: InChI=1/C14H20N3O5PS/c1-5-19-14(18)11-9-17-12(15-10(11)4)8-13(16-17)22-23(24,20-6-2)21-7-3/h8-9H,5-7H2,1-4H3
44 atoms
S  3.106963 1.149709 1.725112
P  3.265481 0.024116 0.184825
O  1.964857 -0.005395 -0.798571
O  3.473864 -1.53195 0.415033
O  4.392202 0.361168 -0.876316
O  -5.059363 1.208198 -1.297777
O  -6.022105 -0.201166 0.14078
N  -1.363487 0.036125 -0.399535
N  -2.107876 -1.1976 1.479935
N  -0.251947 0.39883 -1.047527
C  -1.111064 -0.756114 0.705845
C  -3.64849 -0.073049 0.033471
C  -2.610251 0.37626 -0.738862
C  -3.341828 -0.885233 1.181006
C  0.705157 -0.177446 -0.352575
C  0.258191 -0.915345 0.751405
C  -4.385092 -1.409282 2.113203
C  -5.03278 0.285498 -0.349278
C  4.236509 -2.065175 1.518758
C  4.77036 1.705529 -1.244377
C  -6.331223 1.636085 -1.815648
C  5.716896 -1.81122 1.380178
C  6.266835 1.75873 -1.402687
C  -6.881199 0.681652 -2.849316
H  -2.714751 0.989801 -1.621974
H  0.823694 -1.478142 1.473989
H  -5.042291 -2.125155 1.61978
H  -3.893775 -1.911066 2.943722
H  -5.01359 -0.613154 2.510822
H  4.021268 -3.131952 1.506603
H  3.849891 -1.654271 2.453341
H  4.436598 2.410396 -0.480382
H  4.260381 1.949942 -2.176823
H  -7.035483 1.790449 -0.997147
H  -6.12479 2.606668 -2.263441
H  6.100702 -2.170872 0.425443
H  6.238884 -2.348484 2.17278
H  5.967567 -0.755018 1.484866
H  6.77481 1.540859 -0.462652
H  6.556918 2.762289 -1.715406
H  6.61829 1.05891 -2.161364
H  -7.1322 -0.29086 -2.427095
H  -7.794794 1.10582 -3.268342
H  -6.178255 0.535353 -3.670022
elementType: S P O N C H
totalener: -1825.71403826 hartree
nucrepener: 2430.31688401 hartree
electener: -4256.03092227 hartree
oneelecener: -7337.36651195 hartree
twoeener: 3081.33558968 hartree
cpcmener: -0.02999224 hartree
kineticenergy: 1819.70456522 hartree
xcener: -138.286185292143 hartree
chargesum: 0.0000000
charge: -0.427184 0.742102 -0.312122 -0.341408 -0.334312 -0.288403 -0.456684 0.160319 -0.340884 -0.353823 0.202981 -0.125013 0.071139 0.189447 0.270880 -0.317473 -0.256280 0.486448 0.038182 0.046171 0.039376 -0.236359 -0.237294 -0.254121 0.157716 0.159255 0.105146 0.095391 0.105050 0.111151 0.095227 0.084978 0.108392 0.091395 0.108353 0.092665 0.098798 0.077361 0.085543 0.091645 0.090752 0.091112 0.095981 0.088403
qa: -0.4272 0.7421 -0.3121 -0.3414 -0.3343 -0.2884 -0.4567 0.1603 -0.3409 -0.3538 0.2030 -0.1250 0.0711 0.1894 0.2709 -0.3175 -0.2563 0.4864 0.0382 0.0462 0.0394 -0.2364 -0.2373 -0.2541 0.1577 0.1593 0.1051 0.0954 0.1051 0.1112 0.0952 0.0850 0.1084 0.0914 0.1084 0.0927 0.0988 0.0774 0.0855 0.0916 0.0908 0.0911 0.0960 0.0884
va: 1.9979 5.5072 2.1643 2.1059 2.1267 2.1283 2.0488 3.4143 3.1409 2.7958 4.1131 3.7390 4.0490 3.8700 4.1924 3.9485 3.9144 4.1170 3.8407 3.8269 3.8403 3.9172 3.9386 3.9196 1.0273 1.0087 1.0049 1.0216 1.0035 0.9911 1.0080 1.0146 0.9952 1.0104 0.9957 1.0060 1.0095 1.0141 1.0055 1.0085 1.0036 1.0122 1.0066 1.0043
dispcorr: -0.019576781 hartree
energy: -1825.733615042740
dipole: 1.54542 -1.28160 0.26382 -0.03178 0.32591 0.29413 -4.87063 3.83997 -1.03066
magnitude: 1.10380 au
magnitude: 2.80563 debye
