program: Orca
programVersion: 5.0.2
elementType: S P O O O O O N N N C C C C C C C C C C C C C C H H H H H H H H H H H H H H H H H H H H
charge: 0
multiplicity: 1
keywords: wb97x-d3
keywords: def2-TZVPP
keywords: def2/J RIJCOSX
keywords: DEFGRID2
keywords: scfconv7
keywords: smallprint printgap noloewdin
keywords: NOSOSCF
formula: C14H20N3O5PS
InChI: InChI=1/C14H20N3O5PS/c1-5-19-14(18)11-9-17-12(15-10(11)4)8-13(16-17)22-23(24,20-6-2)21-7-3/h8-9H,5-7H2,1-4H3
44 atoms
S  2.827134 0.628149 -2.003446
P  3.090225 -0.126958 -0.263252
O  2.212263 -1.464546 0.091815
O  2.861313 0.81679 0.994521
O  4.482963 -0.821911 0.041912
O  -4.303935 1.546402 -0.243896
O  -5.6771 0.033248 0.649669
N  -1.079792 -0.745261 0.192244
N  -2.398192 -2.69891 0.406862
N  0.189105 -0.337152 0.10586
C  -1.196961 -2.120134 0.307417
C  -3.393058 -0.526528 0.266291
C  -2.153828 0.046103 0.161227
C  -3.474226 -1.955136 0.397424
C  0.874151 -1.459348 0.157411
C  0.092271 -2.612271 0.283233
C  -4.77311 -2.68387 0.503399
C  -4.583371 0.352415 0.252062
C  2.155865 2.076211 0.952238
C  5.722088 -0.363337 -0.535021
C  -5.345527 2.537021 -0.268898
C  3.117588 3.231346 0.843016
C  6.207941 0.926106 0.078585
C  -4.777802 3.778303 -0.907637
H  -1.966161 1.10572 0.062077
H  0.415097 -3.637353 0.346172
H  -4.582491 -3.754225 0.473654
H  -5.287126 -2.451832 1.435994
H  -5.450249 -2.4278 -0.311093
H  1.589611 2.119396 1.881868
H  1.443067 2.08125 0.128264
H  5.603524 -0.265211 -1.616079
H  6.425902 -1.172566 -0.347859
H  -6.195398 2.158771 -0.840343
H  -5.68329 2.738027 0.749939
H  3.647928 3.223907 -0.109398
H  3.847352 3.230071 1.65295
H  2.556606 4.165211 0.902181
H  6.272388 0.856064 1.164583
H  5.57161 1.772437 -0.180944
H  7.207028 1.141655 -0.302477
H  -4.451257 3.591991 -1.931248
H  -5.551025 4.546037 -0.94071
H  -3.93674 4.178152 -0.340283
elementType: S P O N C H
totalener: -1825.71291894 hartree
nucrepener: 2478.31879261 hartree
electener: -4304.03171154 hartree
oneelecener: -7433.22227012 hartree
twoeener: 3129.19055857 hartree
cpcmener: -0.02901954 hartree
kineticenergy: 1819.73119536 hartree
xcener: -138.293638016853 hartree
chargesum: -0.0000000
charge: -0.436518 0.741945 -0.316833 -0.337045 -0.338112 -0.283929 -0.454459 0.171720 -0.346727 -0.414370 0.207839 -0.114238 0.071816 0.195771 0.338686 -0.327277 -0.256708 0.462983 0.068743 0.032904 0.038897 -0.263092 -0.250116 -0.253866 0.160681 0.167122 0.096452 0.105798 0.106211 0.108148 0.089433 0.094037 0.109082 0.096510 0.100635 0.079873 0.095332 0.103195 0.093817 0.084872 0.101705 0.089165 0.091441 0.088479
qa: -0.4365 0.7419 -0.3168 -0.3370 -0.3381 -0.2839 -0.4545 0.1717 -0.3467 -0.4144 0.2078 -0.1142 0.0718 0.1958 0.3387 -0.3273 -0.2567 0.4630 0.0687 0.0329 0.0389 -0.2631 -0.2501 -0.2539 0.1607 0.1671 0.0965 0.1058 0.1062 0.1081 0.0894 0.0940 0.1091 0.0965 0.1006 0.0799 0.0953 0.1032 0.0938 0.0849 0.1017 0.0892 0.0914 0.0885
va: 1.9858 5.5037 2.1980 2.0813 2.1228 2.1287 2.0547 3.4356 3.1315 2.7991 4.0268 3.7441 4.0315 3.8590 4.0518 3.8862 3.9179 4.1144 3.7953 3.8554 3.8442 3.9462 3.8966 3.9699 1.0192 0.9999 1.0216 1.0053 1.0025 0.9938 1.0162 1.0118 0.9921 0.9960 0.9960 1.0081 1.0008 1.0109 1.0064 1.0044 1.0099 1.0033 1.0068 1.0024
dispcorr: -0.020262189 hartree
energy: -1825.733181124275
dipole: -1.31516 1.30257 -0.01258 21.69152 -19.54745 2.14407 2.37675 -1.89912 0.47764
magnitude: 2.19666 au
magnitude: 5.58348 debye
