program: Orca
programVersion: 5.0.2
elementType: S P O O O O O N N N C C C C C C C C C C C C C C H H H H H H H H H H H H H H H H H H H H
charge: 0
multiplicity: 1
keywords: wb97x-d3
keywords: def2-TZVPP
keywords: def2/J RIJCOSX
keywords: DEFGRID2
keywords: scfconv7
keywords: smallprint printgap noloewdin
keywords: NOSOSCF
formula: C14H20N3O5PS
InChI: InChI=1/C14H20N3O5PS/c1-5-19-14(18)11-9-17-12(15-10(11)4)8-13(16-17)22-23(24,20-6-2)21-7-3/h8-9H,5-7H2,1-4H3
44 atoms
S  3.172376 0.184553 -1.813703
P  3.224472 0.212253 0.09987
O  1.817778 0.600073 0.828242
O  4.182143 1.252766 0.813911
O  3.570308 -1.136356 0.861375
O  -5.279516 1.028777 0.348155
O  -5.979583 -0.902817 -0.51541
N  -1.439799 0.027972 0.295696
N  -1.889549 -2.097261 -0.644632
N  -0.433511 0.808517 0.702063
C  -1.015142 -1.198681 -0.180437
C  -3.649971 -0.55037 -0.155048
C  -2.734732 0.353606 0.316929
C  -3.16591 -1.81309 -0.647823
C  0.630497 0.065872 0.485406
C  0.358249 -1.19789 -0.054533
C  -4.06125 -2.875956 -1.195651
C  -5.084718 -0.185673 -0.138957
C  4.34239 2.611846 0.345519
C  4.509667 -2.10374 0.343682
C  -6.627181 1.522725 0.435662
C  5.604318 2.748395 -0.465884
C  5.936379 -1.621404 0.41941
C  -6.569797 2.899822 1.045429
H  -2.973607 1.331405 0.709304
H  1.03688 -1.989914 -0.320119
H  -4.635144 -2.521597 -2.051276
H  -3.450767 -3.717922 -1.513757
H  -4.774338 -3.227699 -0.450599
H  4.38275 3.222924 1.24631
H  3.467776 2.926446 -0.22713
H  4.231048 -2.362329 -0.679716
H  4.36217 -2.98526 0.964908
H  -7.068842 1.554801 -0.562409
H  -7.225689 0.847617 1.050549
H  6.477862 2.418884 0.097234
H  5.750712 3.79742 -0.725922
H  5.548771 2.177215 -1.392328
H  6.205497 -1.320272 1.431862
H  6.128931 -0.788156 -0.25753
H  6.597574 -2.438337 0.127457
H  -6.149166 2.879376 2.051238
H  -5.984486 3.588921 0.435831
H  -7.582035 3.298096 1.117543
elementType: S P O N C H
totalener: -1825.71421586 hartree
nucrepener: 2435.02089781 hartree
electener: -4260.73511367 hartree
oneelecener: -7346.72770374 hartree
twoeener: 3085.99259006 hartree
cpcmener: -0.03002653 hartree
kineticenergy: 1819.71216526 hartree
xcener: -138.287399276782 hartree
chargesum: -0.0000000
charge: -0.425276 0.745134 -0.311038 -0.339990 -0.342633 -0.282982 -0.456142 0.159474 -0.340891 -0.355098 0.197713 -0.122953 0.073166 0.193077 0.277211 -0.311740 -0.253849 0.481553 0.047025 0.036368 0.033926 -0.244961 -0.235011 -0.253781 0.159498 0.155871 0.104981 0.095770 0.104203 0.107115 0.092928 0.094771 0.111288 0.099321 0.097783 0.090465 0.099889 0.079353 0.092943 0.077570 0.098542 0.088555 0.088573 0.092279
qa: -0.4253 0.7451 -0.3110 -0.3400 -0.3426 -0.2830 -0.4561 0.1595 -0.3409 -0.3551 0.1977 -0.1230 0.0732 0.1931 0.2772 -0.3117 -0.2538 0.4816 0.0470 0.0364 0.0339 -0.2450 -0.2350 -0.2538 0.1595 0.1559 0.1050 0.0958 0.1042 0.1071 0.0929 0.0948 0.1113 0.0993 0.0978 0.0905 0.0999 0.0794 0.0929 0.0776 0.0985 0.0886 0.0886 0.0923
va: 1.9935 5.5055 2.1654 2.1133 2.1086 2.1281 2.0574 3.4165 3.1410 2.7975 4.1223 3.7490 4.0443 3.8689 4.1827 3.9559 3.9144 4.1104 3.8530 3.8482 3.8470 3.9177 3.9191 3.9680 1.0243 1.0114 1.0041 1.0218 1.0041 0.9958 1.0061 1.0085 0.9909 0.9952 0.9959 1.0027 1.0097 1.0176 1.0059 1.0112 1.0096 1.0029 1.0028 1.0069
dispcorr: -0.019662865 hartree
energy: -1825.733878723237
dipole: 1.64543 -1.49533 0.15010 6.14100 -5.22088 0.92012 1.22727 -0.43763 0.78964
magnitude: 1.22175 au
magnitude: 3.10545 debye
