program: Orca
programVersion: 5.0.2
elementType: S P O O O O O N N N C C C C C C C C C C C C C C H H H H H H H H H H H H H H H H H H H H
charge: 0
multiplicity: 1
keywords: wb97x-d3
keywords: def2-TZVPP
keywords: def2/J RIJCOSX
keywords: DEFGRID2
keywords: scfconv7
keywords: smallprint printgap noloewdin
keywords: NOSOSCF
formula: C14H20N3O5PS
InChI: InChI=1/C14H20N3O5PS/c1-5-19-14(18)11-9-17-12(15-10(11)4)8-13(16-17)22-23(24,20-6-2)21-7-3/h8-9H,5-7H2,1-4H3
44 atoms
S  3.425028 1.522153 1.263359
P  3.40831 -0.002518 0.103724
O  2.050229 -0.222166 -0.769927
O  3.532023 -1.448254 0.74532
O  4.489506 -0.0448 -1.056505
O  -5.012851 0.364123 -1.603268
O  -5.917702 -0.017605 0.394699
N  -1.27025 -0.107468 -0.341918
N  -1.958522 -0.539756 1.881115
N  -0.175716 0.001628 -1.102395
C  -0.983255 -0.40616 0.97704
C  -3.547641 -0.086152 0.1486
C  -2.529721 0.046187 -0.759822
C  -3.204462 -0.388969 1.513026
C  0.805051 -0.238354 -0.258006
C  0.390569 -0.503583 1.053807
C  -4.219018 -0.550072 2.597385
C  -4.944619 0.085917 -0.312008
C  4.530817 -1.755328 1.747118
C  5.035866 1.139508 -1.677012
C  -6.314219 0.552438 -2.187212
C  3.920111 -1.773114 3.123716
C  4.059707 1.806045 -2.613297
C  -6.120978 0.847858 -3.651779
H  -2.660157 0.272417 -1.808239
H  0.976903 -0.730263 1.927122
H  -4.821542 0.348335 2.725617
H  -4.903655 -1.3726 2.392033
H  -3.702325 -0.756569 3.531956
H  5.360513 -1.046877 1.694445
H  4.919287 -2.73513 1.473711
H  5.913083 0.78469 -2.215664
H  5.373103 1.828209 -0.900104
H  -6.911786 -0.35032 -2.045788
H  -6.823311 1.378232 -1.686083
H  3.086274 -2.473031 3.181633
H  3.573135 -0.784738 3.423481
H  4.674447 -2.095576 3.842702
H  3.692681 1.115242 -3.372509
H  4.569174 2.623961 -3.124426
H  3.206066 2.232703 -2.085389
H  -7.097202 0.992755 -4.114892
H  -5.541595 1.758068 -3.808491
H  -5.627012 0.025097 -4.169275
elementType: S P O N C H
totalener: -1825.71427650 hartree
nucrepener: 2444.34896698 hartree
electener: -4270.06324348 hartree
oneelecener: -7365.42823172 hartree
twoeener: 3095.36498824 hartree
cpcmener: -0.02994102 hartree
kineticenergy: 1819.68969394 hartree
xcener: -138.283669377315 hartree
chargesum: 0.0000000
charge: -0.428086 0.746621 -0.304865 -0.340726 -0.343288 -0.283714 -0.456483 0.157999 -0.339122 -0.359659 0.176084 -0.120457 0.072759 0.192900 0.295054 -0.293105 -0.253358 0.480719 0.036971 0.030195 0.035215 -0.246051 -0.235337 -0.253973 0.159632 0.151943 0.103712 0.104833 0.096003 0.095000 0.107794 0.109617 0.095470 0.098495 0.098142 0.089765 0.080423 0.103740 0.091281 0.097892 0.080623 0.092384 0.088533 0.088423
qa: -0.4281 0.7466 -0.3049 -0.3407 -0.3433 -0.2837 -0.4565 0.1580 -0.3391 -0.3597 0.1761 -0.1205 0.0728 0.1929 0.2951 -0.2931 -0.2534 0.4807 0.0370 0.0302 0.0352 -0.2461 -0.2353 -0.2540 0.1596 0.1519 0.1037 0.1048 0.0960 0.0950 0.1078 0.1096 0.0955 0.0985 0.0981 0.0898 0.0804 0.1037 0.0913 0.0979 0.0806 0.0924 0.0885 0.0884
va: 1.9910 5.5001 2.1621 2.1073 2.1278 2.1295 2.0571 3.4210 3.1445 2.7993 4.1861 3.7498 4.0434 3.8683 4.1635 3.9780 3.9154 4.1095 3.8691 3.8567 3.8455 3.9076 3.8943 3.9683 1.0240 1.0102 1.0045 1.0040 1.0216 1.0033 0.9959 0.9923 1.0108 0.9960 0.9958 1.0025 1.0164 1.0101 1.0064 1.0086 1.0164 1.0068 1.0030 1.0029
dispcorr: -0.019677035 hartree
energy: -1825.733953534060
dipole: -5.44171 5.68649 0.24478 0.68910 -0.95826 -0.26917 -5.19434 3.98821 -1.20614
magnitude: 1.25982 au
magnitude: 3.20220 debye
