program: Orca
programVersion: 5.0.2
elementType: S P O O O O O N N N C C C C C C C C C C C C C C H H H H H H H H H H H H H H H H H H H H
charge: 0
multiplicity: 1
keywords: wb97x-d3
keywords: def2-TZVPP
keywords: def2/J RIJCOSX
keywords: DEFGRID2
keywords: scfconv7
keywords: smallprint printgap noloewdin
keywords: NOSOSCF
formula: C14H20N3O5PS
InChI: InChI=1/C14H20N3O5PS/c1-5-19-14(18)11-9-17-12(15-10(11)4)8-13(16-17)22-23(24,20-6-2)21-7-3/h8-9H,5-7H2,1-4H3
44 atoms
S  3.565049 0.427598 -1.791934
P  3.467401 0.019784 0.075871
O  2.112283 0.497599 0.846688
O  4.555055 0.669671 1.02927
O  3.481841 -1.507104 0.506572
O  -5.821627 -0.110356 -0.045263
O  -5.016001 1.635783 1.076205
N  -1.209102 0.386258 0.445382
N  -1.928094 -1.22416 -1.133493
N  -0.106561 0.891276 1.006099
C  -0.941185 -0.616495 -0.468722
C  -3.492549 0.148821 0.043849
C  -2.461968 0.767628 0.700867
C  -3.170629 -0.879458 -0.909361
C  0.86307 0.199672 0.445184
C  0.431076 -0.759382 -0.481011
C  -4.190903 -1.606798 -1.724976
C  -4.843376 0.642671 0.407869
C  5.178288 1.944984 0.764401
C  4.257974 -2.506045 -0.187789
C  -7.175553 0.275481 0.251963
C  4.255535 3.107622 1.030759
C  5.739147 -2.365649 0.061708
C  -8.086118 -0.754036 -0.365461
H  -2.593929 1.556495 1.428217
H  1.005689 -1.448346 -1.075248
H  -4.84285 -2.220674 -1.10381
H  -4.825425 -0.923244 -2.28817
H  -3.676557 -2.258661 -2.427403
H  5.545679 1.958818 -0.263506
H  6.040028 1.970408 1.429002
H  4.030723 -2.460157 -1.254738
H  3.885522 -3.45462 0.19469
H  -7.312421 0.320389 1.334119
H  -7.369776 1.26905 -0.15696
H  3.857923 3.082936 2.04535
H  3.422201 3.143596 0.328069
H  4.819145 4.034341 0.915528
H  6.252284 -3.216386 -0.388123
H  5.969535 -2.363452 1.127251
H  6.150848 -1.461638 -0.388749
H  -7.97231 -0.796953 -1.44904
H  -7.907222 -1.748421 0.044714
H  -9.121045 -0.487702 -0.150406
elementType: S P O N C H
totalener: -1825.71373299 hartree
nucrepener: 2436.57609088 hartree
electener: -4262.28982387 hartree
oneelecener: -7349.91769772 hartree
twoeener: 3087.62787385 hartree
cpcmener: -0.03068090 hartree
kineticenergy: 1819.70859111 hartree
xcener: -138.287538332188 hartree
chargesum: 0.0000000
charge: -0.425653 0.741877 -0.306404 -0.341749 -0.343684 -0.271011 -0.466810 0.154047 -0.341545 -0.359213 0.173084 -0.114508 0.087771 0.187958 0.295864 -0.285380 -0.265128 0.472754 0.036045 0.037282 0.031915 -0.237824 -0.239106 -0.258981 0.149520 0.146662 0.105745 0.109576 0.098731 0.094624 0.110321 0.094388 0.109418 0.099042 0.101503 0.091739 0.081752 0.098048 0.097553 0.092479 0.080952 0.089756 0.090174 0.096412
qa: -0.4257 0.7419 -0.3064 -0.3417 -0.3437 -0.2710 -0.4668 0.1540 -0.3415 -0.3592 0.1731 -0.1145 0.0878 0.1880 0.2959 -0.2854 -0.2651 0.4728 0.0360 0.0373 0.0319 -0.2378 -0.2391 -0.2590 0.1495 0.1467 0.1057 0.1096 0.0987 0.0946 0.1103 0.0944 0.1094 0.0990 0.1015 0.0917 0.0818 0.0980 0.0976 0.0925 0.0810 0.0898 0.0902 0.0964
va: 1.9981 5.5022 2.1715 2.1199 2.1089 2.1558 2.0456 3.4360 3.1426 2.8059 4.1744 3.7179 4.0376 3.8436 4.1561 3.9711 3.9211 4.1192 3.8461 3.8540 3.8481 3.9043 3.9144 3.9649 1.0331 1.0181 1.0019 1.0013 1.0238 1.0107 0.9917 1.0092 0.9911 0.9956 0.9966 1.0062 1.0157 1.0085 1.0089 1.0059 1.0139 1.0019 1.0029 1.0072
dispcorr: -0.020027510 hartree
energy: -1825.733760498047
dipole: -7.42918 6.75425 -0.67492 -5.15940 4.02770 -1.13170 -1.77354 1.65341 -0.12013
magnitude: 1.32314 au
magnitude: 3.36314 debye
