program: Orca
programVersion: 5.0.2
elementType: S P O O O O O N N N C C C C C C C C C C C C C C H H H H H H H H H H H H H H H H H H H H
charge: 0
multiplicity: 1
keywords: wb97x-d3
keywords: def2-TZVPP
keywords: def2/J RIJCOSX
keywords: DEFGRID2
keywords: scfconv7
keywords: smallprint printgap noloewdin
keywords: NOSOSCF
formula: C14H20N3O5PS
InChI: InChI=1/C14H20N3O5PS/c1-5-19-14(18)11-9-17-12(15-10(11)4)8-13(16-17)22-23(24,20-6-2)21-7-3/h8-9H,5-7H2,1-4H3
44 atoms
S  5.067952 -0.185106 -0.956555
P  3.309981 -0.036985 -0.217726
O  2.199904 -0.6264 -1.255637
O  2.819847 1.422165 0.18159
O  2.947824 -0.87348 1.082963
O  -4.312306 1.512018 0.892674
O  -5.617711 -0.291319 0.748868
N  -1.047046 -0.373117 -0.358118
N  -2.207373 -2.413429 -0.664793
N  0.160021 0.183451 -0.491645
C  -1.076338 -1.704302 -0.735837
C  -3.317654 -0.45501 0.151707
C  -2.146176 0.250342 0.075781
C  -3.30296 -1.840415 -0.238989
C  0.897022 -0.806995 -0.948584
C  0.210115 -2.00996 -1.130261
C  -4.511828 -2.716068 -0.192525
C  -4.540292 0.23652 0.621773
C  3.182907 2.601976 -0.563897
C  3.897306 -1.082914 2.151598
C  -5.408144 2.335404 1.327772
C  2.523746 2.667962 -1.920119
C  4.221075 0.17842 2.913131
C  -6.252384 2.814883 0.17039
H  -2.030807 1.29101 0.342147
H  0.592564 -2.950585 -1.487988
H  -4.237114 -3.710621 -0.53642
H  -4.914063 -2.796926 0.81684
H  -5.310959 -2.337755 -0.829527
H  4.270423 2.649308 -0.651094
H  2.861525 3.431201 0.064155
H  4.80098 -1.537031 1.739886
H  3.419305 -1.815844 2.799011
H  -6.007135 1.804327 2.068759
H  -4.9300 3.176393 1.827267
H  2.894088 1.899125 -2.599284
H  2.749418 3.635083 -2.371176
H  1.439938 2.578338 -1.846405
H  4.850612 -0.082612 3.764771
H  3.322255 0.66072 3.297323
H  4.775671 0.897683 2.30955
H  -6.78708 2.002574 -0.320495
H  -6.9951 3.521333 0.543706
H  -5.647502 3.333955 -0.573702
elementType: S P O N C H
totalener: -1825.71141574 hartree
nucrepener: 2480.36573428 hartree
electener: -4306.07715002 hartree
oneelecener: -7437.44507507 hartree
twoeener: 3131.36792505 hartree
cpcmener: -0.02933277 hartree
kineticenergy: 1819.70775377 hartree
xcener: -138.287226095156 hartree
chargesum: 0.0000000
charge: -0.422118 0.710482 -0.333853 -0.319602 -0.326305 -0.287130 -0.456375 0.193477 -0.344457 -0.404784 0.213961 -0.138696 0.074524 0.193309 0.301307 -0.310162 -0.249644 0.487023 0.031192 0.020030 0.037290 -0.245649 -0.234313 -0.253351 0.160724 0.167204 0.095555 0.104179 0.104687 0.097156 0.110478 0.095058 0.108679 0.091992 0.106801 0.084794 0.104571 0.087600 0.098301 0.092082 0.079725 0.090494 0.095819 0.087945
qa: -0.4221 0.7105 -0.3339 -0.3196 -0.3263 -0.2871 -0.4564 0.1935 -0.3445 -0.4048 0.2140 -0.1387 0.0745 0.1933 0.3013 -0.3102 -0.2496 0.4870 0.0312 0.0200 0.0373 -0.2456 -0.2343 -0.2534 0.1607 0.1672 0.0956 0.1042 0.1047 0.0972 0.1105 0.0951 0.1087 0.0920 0.1068 0.0848 0.1046 0.0876 0.0983 0.0921 0.0797 0.0905 0.0958 0.0879
va: 2.0250 5.5147 2.1375 2.0772 2.1162 2.1280 2.0508 3.3730 3.1281 2.7659 4.0214 3.7560 4.0398 3.8705 4.0699 3.9177 3.9143 4.1178 3.8446 3.8708 3.8462 3.8990 3.8863 3.9166 1.0245 0.9996 1.0220 1.0046 1.0043 1.0119 0.9913 1.0083 0.9908 1.0096 0.9957 1.0156 1.0107 1.0155 1.0093 1.0061 1.0169 1.0130 1.0068 1.0046
dispcorr: -0.020255660 hartree
energy: -1825.731671398218
dipole: -12.95870 11.70558 -1.25313 14.90741 -12.93017 1.97724 8.25154 -6.81437 1.43716
magnitude: 2.74686 au
magnitude: 6.98196 debye
