program: Orca
programVersion: 5.0.2
elementType: S P O O O O O N N N C C C C C C C C C C C C C C H H H H H H H H H H H H H H H H H H H H
charge: 0
multiplicity: 1
keywords: wb97x-d3
keywords: def2-TZVPP
keywords: def2/J RIJCOSX
keywords: DEFGRID2
keywords: scfconv7
keywords: smallprint printgap noloewdin
keywords: NOSOSCF
formula: C14H20N3O5PS
InChI: InChI=1/C14H20N3O5PS/c1-5-19-14(18)11-9-17-12(15-10(11)4)8-13(16-17)22-23(24,20-6-2)21-7-3/h8-9H,5-7H2,1-4H3
44 atoms
S  3.089916 2.120534 0.435876
P  3.334078 0.232192 0.233343
O  2.317734 -0.716206 1.106192
O  4.714169 -0.37924 0.723822
O  3.194915 -0.416896 -1.206278
O  -5.379148 0.249399 -0.940917
O  -3.841749 0.785142 -2.460955
N  -0.866938 -0.341713 0.055805
N  -2.40463 -1.381614 1.522588
N  0.439176 -0.126131 -0.120445
C  -1.145601 -1.067431 1.201521
C  -3.139316 -0.212436 -0.432677
C  -1.840527 0.078919 -0.752443
C  -3.388651 -0.983312 0.756903
C  0.987233 -0.711939 0.922819
C  0.07501 -1.31957 1.793328
C  -4.752729 -1.406638 1.198332
C  -4.144123 0.319282 -1.386271
C  5.499399 0.205463 1.783634
C  3.096165 0.3529 -2.421093
C  -6.444858 0.747873 -1.769144
C  4.895264 -0.019387 3.147203
C  4.452082 0.786006 -2.916738
C  -7.735523 0.514697 -1.02639
H  -1.541239 0.644013 -1.624569
H  0.274277 -1.857254 2.704792
H  -5.287237 -1.941774 0.414044
H  -4.655671 -2.064091 2.059104
H  -5.366648 -0.553548 1.48768
H  5.638055 1.270099 1.583888
H  6.47032 -0.279597 1.70229
H  2.438679 1.209143 -2.261971
H  2.610639 -0.311961 -3.133847
H  -6.287929 1.810955 -1.961548
H  -6.442352 0.224019 -2.72688
H  3.95374 0.516461 3.27494
H  5.587275 0.35379 3.903385
H  4.726281 -1.078516 3.343232
H  4.930891 1.483901 -2.228745
H  4.335769 1.294186 -3.874495
H  5.114723 -0.066281 -3.067951
H  -7.74847 1.032754 -0.066782
H  -8.564492 0.898698 -1.62114
H  -7.91555 -0.54665 -0.852466
elementType: S P O N C H
totalener: -1825.71272479 hartree
nucrepener: 2462.14730366 hartree
electener: -4287.86002846 hartree
oneelecener: -7401.41182036 hartree
twoeener: 3113.55179190 hartree
cpcmener: -0.02905875 hartree
kineticenergy: 1819.71669115 hartree
xcener: -138.289659762113 hartree
chargesum: 0.0000000
charge: -0.435464 0.763932 -0.317166 -0.342938 -0.345445 -0.270385 -0.468029 0.174184 -0.347371 -0.409081 0.208685 -0.122743 0.089415 0.191840 0.334714 -0.325172 -0.261614 0.465939 0.030642 0.043262 0.031678 -0.237714 -0.237483 -0.259780 0.152298 0.166694 0.108704 0.098627 0.106302 0.094211 0.108858 0.090275 0.109339 0.100360 0.100553 0.080269 0.097908 0.091072 0.078042 0.094982 0.090725 0.090245 0.096891 0.089738
qa: -0.4355 0.7639 -0.3172 -0.3429 -0.3454 -0.2704 -0.4680 0.1742 -0.3474 -0.4091 0.2087 -0.1227 0.0894 0.1918 0.3347 -0.3252 -0.2616 0.4659 0.0306 0.0433 0.0317 -0.2377 -0.2375 -0.2598 0.1523 0.1667 0.1087 0.0986 0.1063 0.0942 0.1089 0.0903 0.1093 0.1004 0.1006 0.0803 0.0979 0.0911 0.0780 0.0950 0.0907 0.0902 0.0969 0.0897
va: 1.9856 5.4706 2.1780 2.1193 2.1039 2.1545 2.0448 3.4254 3.1325 2.7860 4.0287 3.7245 4.0233 3.8359 4.0547 3.8863 3.9242 4.1215 3.8586 3.8476 3.8483 3.8907 3.9304 3.9649 1.0294 1.0000 1.0015 1.0242 1.0016 1.0109 0.9921 1.0141 0.9919 0.9948 0.9968 1.0183 1.0088 1.0063 1.0177 1.0079 1.0056 1.0028 1.0074 1.0020
dispcorr: -0.019928055 hartree
energy: -1825.732652849188
dipole: -10.69384 9.35182 -1.34202 1.09484 -1.46636 -0.37152 -2.79780 2.64949 -0.14831
magnitude: 1.40037 au
magnitude: 3.55947 debye
