program: Orca
programVersion: 5.0.2
elementType: S P O O O O O N N N C C C C C C C C C C C C C C H H H H H H H H H H H H H H H H H H H H
charge: 0
multiplicity: 1
keywords: wb97x-d3
keywords: def2-TZVPP
keywords: def2/J RIJCOSX
keywords: DEFGRID2
keywords: scfconv7
keywords: smallprint printgap noloewdin
keywords: NOSOSCF
formula: C14H20N3O5PS
InChI: InChI=1/C14H20N3O5PS/c1-5-19-14(18)11-9-17-12(15-10(11)4)8-13(16-17)22-23(24,20-6-2)21-7-3/h8-9H,5-7H2,1-4H3
44 atoms
S  5.079529 -0.271221 -0.573241
P  3.231311 0.176544 -0.364566
O  2.299304 -1.123203 -0.688882
O  2.602974 1.245937 -1.353064
O  2.768024 0.696736 1.065813
O  -4.298456 1.394374 0.6197
O  -5.681388 -0.32056 0.293603
N  -1.018616 -0.66524 -0.233467
N  -2.23049 -2.659706 -0.62317
N  0.222165 -0.166767 -0.232676
C  -1.064251 -2.006849 -0.570593
C  -3.334465 -0.627692 0.001239
C  -2.127796 0.020221 0.049593
C  -3.340545 -2.022322 -0.352924
C  0.961978 -1.200886 -0.56924
C  0.244383 -2.381501 -0.79556
C  -4.58967 -2.836919 -0.439058
C  -4.564138 0.135654 0.311628
C  3.300342 2.444108 -1.754612
C  3.37317 0.25251 2.297964
C  -5.39514 2.262228 0.955625
C  3.406729 3.460844 -0.645301
C  3.001289 -1.165679 2.651475
C  -4.818485 3.616073 1.281905
H  -1.992131 1.062082 0.300343
H  0.620211 -3.349909 -1.078166
H  -5.11908 -2.86804 0.512766
H  -5.281358 -2.439839 -1.181333
H  -4.326929 -3.853886 -0.721281
H  2.711809 2.834023 -2.583169
H  4.285901 2.174388 -2.139846
H  3.004192 0.948857 3.04897
H  4.456218 0.372139 2.230106
H  -6.084765 2.323035 0.111282
H  -5.937921 1.851961 1.809515
H  3.80935 4.386178 -1.059281
H  4.079699 3.139374 0.150085
H  2.43219 3.686084 -0.212042
H  3.426681 -1.890541 1.956801
H  1.920197 -1.302709 2.685046
H  3.396584 -1.393748 3.642279
H  -5.630675 4.29486 1.543191
H  -4.137115 3.570485 2.13183
H  -4.28787 4.044786 0.431284
elementType: S P O N C H
totalener: -1825.71344612 hartree
nucrepener: 2482.61051319 hartree
electener: -4308.32395931 hartree
oneelecener: -7441.79175183 hartree
twoeener: 3133.46779252 hartree
cpcmener: -0.03098101 hartree
kineticenergy: 1819.69844736 hartree
xcener: -138.286152574184 hartree
chargesum: -0.0000000
charge: -0.418298 0.692090 -0.307872 -0.317362 -0.321710 -0.283910 -0.456993 0.174000 -0.346422 -0.392198 0.214958 -0.131052 0.074978 0.194721 0.313995 -0.327308 -0.247505 0.476224 0.018991 0.035847 0.034287 -0.234603 -0.244536 -0.254837 0.160568 0.165870 0.103742 0.103600 0.094965 0.108988 0.093103 0.109544 0.095353 0.099210 0.098206 0.098091 0.081169 0.091380 0.085850 0.089811 0.105286 0.092317 0.088791 0.088671
qa: -0.4183 0.6921 -0.3079 -0.3174 -0.3217 -0.2839 -0.4570 0.1740 -0.3464 -0.3922 0.2150 -0.1311 0.0750 0.1947 0.3140 -0.3273 -0.2475 0.4762 0.0190 0.0358 0.0343 -0.2346 -0.2445 -0.2548 0.1606 0.1659 0.1037 0.1036 0.0950 0.1090 0.0931 0.1095 0.0954 0.0992 0.0982 0.0981 0.0812 0.0914 0.0859 0.0898 0.1053 0.0923 0.0888 0.0887
va: 2.0383 5.5241 2.1714 2.1153 2.0636 2.1272 2.0568 3.4146 3.1297 2.7380 4.0219 3.7550 4.0343 3.8675 4.0636 3.8951 3.9158 4.1140 3.8747 3.8426 3.8459 3.8882 3.9048 3.9675 1.0221 1.0010 1.0043 1.0045 1.0222 0.9907 1.0098 0.9911 1.0121 0.9955 0.9960 1.0092 1.0150 1.0066 1.0158 1.0067 1.0101 1.0070 1.0028 1.0029
dispcorr: -0.020004552 hartree
energy: -1825.733450673505
dipole: -10.98097 9.80380 -1.17717 16.58759 -14.32989 2.25770 11.44627 -10.18401 1.26226
magnitude: 2.84187 au
magnitude: 7.22346 debye
