program: Orca
programVersion: 5.0.2
elementType: S P O O O O O N N N C C C C C C C C C C C C C C H H H H H H H H H H H H H H H H H H H H
charge: 0
multiplicity: 1
keywords: wb97x-d3
keywords: def2-TZVPP
keywords: def2/J RIJCOSX
keywords: DEFGRID2
keywords: scfconv7
keywords: smallprint printgap noloewdin
keywords: NOSOSCF
formula: C14H20N3O5PS
InChI: InChI=1/C14H20N3O5PS/c1-5-19-14(18)11-9-17-12(15-10(11)4)8-13(16-17)22-23(24,20-6-2)21-7-3/h8-9H,5-7H2,1-4H3
44 atoms
S  2.950262 1.093216 -1.770025
P  3.204031 0.317791 -0.037552
O  2.374915 -1.056405 0.283351
O  2.83806 1.168581 1.248401
O  4.665511 -0.203521 0.305239
O  -4.308321 1.478074 -0.183822
O  -5.656269 -0.286674 -0.009867
N  -0.96647 -0.620138 0.147431
N  -2.127798 -2.673687 0.317833
N  0.265493 -0.103048 0.132001
C  -0.974059 -1.998395 0.277993
C  -3.292377 -0.593839 0.080625
C  -2.09834 0.077533 0.046646
C  -3.260154 -2.024754 0.225993
C  1.038119 -1.160311 0.248428
C  0.351511 -2.376763 0.342727
C  -4.493156 -2.865306 0.285666
C  -4.545546 0.184835 -0.036115
C  2.853162 2.61174 1.2802
C  5.580282 -0.70831 -0.688928
C  -5.429395 2.368385 -0.312774
C  1.45708 3.164289 1.164656
C  5.183806 -2.065834 -1.212728
C  -4.88472 3.765687 -0.461535
H  -1.990188 1.147247 -0.056889
H  0.756203 -3.36917 0.445476
H  -4.203461 -3.907429 0.399523
H  -5.129372 -2.588971 1.126022
H  -5.093098 -2.769019 -0.618684
H  3.497101 3.003564 0.491016
H  3.303546 2.873831 2.236381
H  6.539553 -0.754795 -0.17681
H  5.667075 0.016551 -1.500072
H  -6.023644 2.08451 -1.183539
H  -6.06332 2.288261 0.572468
H  1.020479 2.956259 0.188851
H  1.493066 4.246387 1.292237
H  0.801705 2.759086 1.935536
H  4.264697 -2.030389 -1.797681
H  5.060139 -2.788611 -0.40681
H  5.973808 -2.431269 -1.869652
H  -5.717425 4.461716 -0.563957
H  -4.30466 4.068765 0.410532
H  -4.259412 3.863786 -1.348945
elementType: S P O N C H
totalener: -1825.71332211 hartree
nucrepener: 2484.43244512 hartree
electener: -4310.14576723 hartree
oneelecener: -7445.78937053 hartree
twoeener: 3135.64360331 hartree
cpcmener: -0.02868625 hartree
kineticenergy: 1819.72538205 hartree
xcener: -138.292085994055 hartree
chargesum: -0.0000000
charge: -0.438301 0.760288 -0.312773 -0.340065 -0.343298 -0.283351 -0.457071 0.180540 -0.346688 -0.407930 0.206168 -0.136868 0.080153 0.196559 0.336386 -0.325040 -0.250613 0.477638 0.044542 0.027104 0.034086 -0.241720 -0.237177 -0.256144 0.161886 0.166914 0.095914 0.103744 0.104395 0.087916 0.106889 0.107975 0.094476 0.098544 0.098636 0.075743 0.102292 0.088122 0.080272 0.090940 0.098111 0.092915 0.088901 0.088990
qa: -0.4383 0.7603 -0.3128 -0.3401 -0.3433 -0.2834 -0.4571 0.1805 -0.3467 -0.4079 0.2062 -0.1369 0.0802 0.1966 0.3364 -0.3250 -0.2506 0.4776 0.0445 0.0271 0.0341 -0.2417 -0.2372 -0.2561 0.1619 0.1669 0.0959 0.1037 0.1044 0.0879 0.1069 0.1080 0.0945 0.0985 0.0986 0.0757 0.1023 0.0881 0.0803 0.0909 0.0981 0.0929 0.0889 0.0890
va: 1.9828 5.4822 2.1800 2.1132 2.1233 2.1268 2.0569 3.4105 3.1306 2.7950 4.0314 3.7634 4.0255 3.8630 4.0556 3.8891 3.9171 4.1131 3.8570 3.8658 3.8465 3.9037 3.8862 3.9675 1.0183 0.9998 1.0220 1.0043 1.0040 1.0105 0.9960 0.9919 1.0101 0.9956 0.9957 1.0182 1.0106 1.0061 1.0178 1.0064 1.0091 1.0069 1.0029 1.0028
dispcorr: -0.019907290 hartree
energy: -1825.733229398961
dipole: -7.00763 7.11575 0.10812 11.58381 -10.13468 1.44913 0.13523 0.28678 0.42201
magnitude: 1.51320 au
magnitude: 3.84624 debye
