program: Orca
programVersion: 5.0.2
elementType: S P O O O O O N N N C C C C C C C C C C C C C C H H H H H H H H H H H H H H H H H H H H
charge: 0
multiplicity: 1
keywords: wb97x-d3
keywords: def2-TZVPP
keywords: def2/J RIJCOSX
keywords: DEFGRID2
keywords: scfconv7
keywords: smallprint printgap noloewdin
keywords: NOSOSCF
formula: C14H20N3O5PS
InChI: InChI=1/C14H20N3O5PS/c1-5-19-14(18)11-9-17-12(15-10(11)4)8-13(16-17)22-23(24,20-6-2)21-7-3/h8-9H,5-7H2,1-4H3
44 atoms
S  3.343709 0.549794 2.02906
P  3.336948 -0.020551 0.200595
O  1.989815 0.322066 -0.652389
O  3.444131 -1.576693 -0.096181
O  4.425491 0.603869 -0.76938
O  -5.081257 0.972686 -1.282164
O  -5.980839 -0.433487 0.192461
N  -1.332835 0.071549 -0.322325
N  -2.013626 -1.460254 1.348832
N  -0.240826 0.593822 -0.889666
C  -1.040469 -0.851532 0.664265
C  -3.61058 -0.248419 0.041498
C  -2.594912 0.369214 -0.640798
C  -3.262804 -1.186759 1.075026
C  0.745337 -0.01047 -0.261699
C  0.335676 -0.927404 0.716318
C  -4.275702 -1.903855 1.906387
C  -5.01022 0.070011 -0.318589
C  4.231052 -2.47133 0.720319
C  4.965854 1.932663 -0.594763
C  -6.380932 1.365412 -1.754848
C  5.714601 -2.268572 0.540646
C  3.99029 3.012077 -0.990501
C  -6.179381 2.382496 -2.848414
H  -2.729973 1.092283 -1.432059
H  0.924909 -1.547246 1.36927
H  -3.755812 -2.525325 2.632051
H  -4.924038 -1.211812 2.442472
H  -4.916351 -2.544461 1.3009
H  3.931244 -3.466977 0.398369
H  3.939719 -2.353462 1.765959
H  5.849178 1.952287 -1.230635
H  5.292897 2.053871 0.439656
H  -6.914148 0.489221 -2.129327
H  -6.958197 1.787072 -0.92962
H  6.243134 -3.049221 1.089151
H  6.052343 -1.30913 0.934338
H  6.007199 -2.340894 -0.506916
H  3.131752 3.060675 -0.319755
H  3.631223 2.877355 -2.010727
H  4.497874 3.976312 -0.940011
H  -5.660735 3.270174 -2.485128
H  -5.618253 1.969195 -3.687015
H  -7.153096 2.69745 -3.223809
elementType: S P O N C H
totalener: -1825.71465615 hartree
nucrepener: 2442.71801195 hartree
electener: -4268.43266811 hartree
oneelecener: -7362.13960755 hartree
twoeener: 3093.70693944 hartree
cpcmener: -0.02987883 hartree
kineticenergy: 1819.70507260 hartree
xcener: -138.287151328544 hartree
chargesum: 0.0000000
charge: -0.425306 0.742460 -0.306835 -0.344704 -0.342118 -0.283142 -0.456491 0.157180 -0.340373 -0.359315 0.176093 -0.122322 0.073396 0.192093 0.294184 -0.288345 -0.252167 0.480855 0.035591 0.035661 0.034552 -0.238879 -0.238150 -0.255446 0.159119 0.146315 0.096118 0.104184 0.103467 0.110214 0.095262 0.110478 0.094990 0.098930 0.098682 0.097983 0.080843 0.092919 0.081929 0.091777 0.098256 0.089284 0.088876 0.091902
qa: -0.4253 0.7425 -0.3068 -0.3447 -0.3421 -0.2831 -0.4565 0.1572 -0.3404 -0.3593 0.1761 -0.1223 0.0734 0.1921 0.2942 -0.2883 -0.2522 0.4809 0.0356 0.0357 0.0346 -0.2389 -0.2381 -0.2554 0.1591 0.1463 0.0961 0.1042 0.1035 0.1102 0.0953 0.1105 0.0950 0.0989 0.0987 0.0980 0.0808 0.0929 0.0819 0.0918 0.0983 0.0893 0.0889 0.0919
va: 1.9974 5.4993 2.1707 2.1078 2.1192 2.1286 2.0566 3.4240 3.1418 2.8035 4.1741 3.7470 4.0439 3.8693 4.1582 3.9762 3.9131 4.1131 3.8535 3.8458 3.8455 3.9139 3.9035 3.9677 1.0242 1.0178 1.0214 1.0042 1.0045 0.9911 1.0086 0.9918 1.0107 0.9957 0.9956 1.0088 1.0144 1.0060 1.0156 1.0063 1.0084 1.0027 1.0028 1.0071
dispcorr: -0.019634824 hartree
energy: -1825.734290977606
dipole: -1.97923 2.21096 0.23173 4.56544 -4.15852 0.40692 -6.58390 5.41024 -1.17365
magnitude: 1.26362 au
magnitude: 3.21188 debye
