program: Orca
programVersion: 5.0.2
elementType: S P O O O O O N N N C C C C C C C C C C C C C C H H H H H H H H H H H H H H H H H H H H
charge: 0
multiplicity: 1
keywords: wb97x-d3
keywords: def2-TZVPP
keywords: def2/J RIJCOSX
keywords: DEFGRID2
keywords: scfconv7
keywords: smallprint printgap noloewdin
keywords: NOSOSCF
formula: C14H20N3O5PS
InChI: InChI=1/C14H20N3O5PS/c1-5-19-14(18)11-9-17-12(15-10(11)4)8-13(16-17)22-23(24,20-6-2)21-7-3/h8-9H,5-7H2,1-4H3
44 atoms
S  3.021544 0.419813 -2.180834
P  3.207602 -0.136378 -0.358232
O  2.284627 -1.401824 0.120095
O  2.967534 0.94653 0.778478
O  4.576345 -0.819396 0.066378
O  -4.1482 1.681107 -0.574526
O  -5.640344 0.137341 0.036492
N  -1.000685 -0.639005 0.060455
N  -2.342136 -2.509717 0.604858
N  0.274576 -0.264185 -0.086822
C  -1.13348 -1.970805 0.413198
C  -3.315376 -0.390498 0.060035
C  -2.065983 0.143784 -0.119541
C  -3.41159 -1.773526 0.444738
C  0.94642 -1.366421 0.168952
C  0.149675 -2.47188 0.488205
C  -4.714292 -2.46478 0.682719
C  -4.497213 0.476611 -0.149616
C  2.324707 2.224093 0.584749
C  5.83218 -0.467926 -0.548977
C  -5.169476 2.673022 -0.780783
C  1.484963 2.532713 1.796376
C  6.289976 0.924239 -0.190606
C  -5.579413 3.341827 0.509984
H  -1.862056 1.16655 -0.401713
H  0.458682 -3.473393 0.734622
H  -4.519498 -3.499663 0.954614
H  -5.278832 -1.995277 1.487949
H  -5.347418 -2.452866 -0.204428
H  1.715685 2.207813 -0.319213
H  3.1102 2.969425 0.448704
H  5.748837 -0.589554 -1.6306
H  6.533568 -1.214467 -0.180872
H  -4.709374 3.392164 -1.456271
H  -6.024086 2.232221 -1.295469
H  0.680704 1.806214 1.919718
H  1.032791 3.517038 1.672221
H  2.080799 2.554204 2.709266
H  6.340966 1.066519 0.889069
H  5.643657 1.693287 -0.616567
H  7.290699 1.080205 -0.595957
H  -6.258363 4.164325 0.28185
H  -6.098264 2.662618 1.185264
H  -4.717279 3.760062 1.030532
elementType: S P O N C H
totalener: -1825.71228901 hartree
nucrepener: 2485.59960734 hartree
electener: -4311.31189635 hartree
oneelecener: -7447.80164181 hartree
twoeener: 3136.48974546 hartree
cpcmener: -0.02826626 hartree
kineticenergy: 1819.70940186 hartree
xcener: -138.290529397847 hartree
chargesum: 0.0000000
charge: -0.437526 0.747076 -0.314292 -0.337373 -0.340112 -0.287032 -0.457299 0.176569 -0.347206 -0.419239 0.210359 -0.143901 0.072314 0.195477 0.339606 -0.329218 -0.249552 0.483486 0.055874 0.029371 0.037087 -0.246587 -0.239263 -0.252778 0.162727 0.166396 0.095577 0.103290 0.104722 0.094512 0.114681 0.095879 0.109106 0.107526 0.091366 0.081757 0.090770 0.092128 0.092325 0.077981 0.099069 0.096505 0.090700 0.087141
qa: -0.4375 0.7471 -0.3143 -0.3374 -0.3401 -0.2870 -0.4573 0.1766 -0.3472 -0.4192 0.2104 -0.1439 0.0723 0.1955 0.3396 -0.3292 -0.2496 0.4835 0.0559 0.0294 0.0371 -0.2466 -0.2393 -0.2528 0.1627 0.1664 0.0956 0.1033 0.1047 0.0945 0.1147 0.0959 0.1091 0.1075 0.0914 0.0818 0.0908 0.0921 0.0923 0.0780 0.0991 0.0965 0.0907 0.0871
va: 1.9844 5.4981 2.2011 2.0791 2.1196 2.1260 2.0505 3.4280 3.1310 2.7882 4.0264 3.7550 4.0219 3.8674 4.0511 3.8864 3.9146 4.1222 3.7867 3.8619 3.8448 3.9529 3.8885 3.9179 1.0218 1.0005 1.0219 1.0052 1.0039 1.0172 0.9945 1.0105 0.9923 0.9956 1.0099 1.0100 1.0064 1.0042 1.0064 1.0168 1.0082 1.0067 1.0123 1.0048
dispcorr: -0.020391640 hartree
energy: -1825.732680654023
dipole: -6.66067 6.61973 -0.04094 19.44716 -17.26606 2.18110 7.51222 -6.95949 0.55272
magnitude: 2.25042 au
magnitude: 5.72011 debye
