program: Gaussian 09
title: 000065956
version: EM64L-G09RevD.01
frameworkgroup: C1[X(C19H36N2)]
method: RPBEPBE
basis: SDD
operation: Freq
keyword: #pfreq=noraman
keyword: PBEPBE/SDD
title: #p freq=noraman PBEPBE/SDD
converged: YES YES NO NO
title: Mulliken charges:
elementType: N N C C C C C C C C C C C C C C C C C C C H H H H H H H H H H H H H H H H H H H H H H H H H H H H H H H H H H H H
charge: -0.050775 -0.059617 0.514768 -0.242575 -0.216588 -0.530044 -0.529314 -0.433206 -0.425717 -0.432103 -0.450493 -0.421147 -0.422029 -0.389246 0.052303 -0.314514 -0.049766 -0.746676 -0.743431 -0.719518 -0.710495 0.206181 0.199804 0.227263 0.190785 0.191483 0.226735 0.211568 0.182790 0.184938 0.209222 0.185730 0.198125 0.203093 0.188635 0.192061 0.199078 0.199666 0.192270 0.186477 0.202074 0.163003 0.172261 0.190043 0.198046 0.208894 0.225921 0.230909 0.230747 0.207497 0.225833 0.187009 0.198609 0.278344 0.202129 0.214536 0.208428
chargesum: 0.00000
title: Mulliken charges with hydrogens summed into heavy atoms:
elementType: N N C C C C C C C C C C C C C C C C C C C
charge: -0.050775 -0.059617 0.514768 -0.036394 -0.016785 -0.111996 -0.111095 -0.038849 -0.031557 -0.048248 -0.058765 -0.030008 -0.030093 -0.000696 0.215306 0.047789 0.148279 -0.080952 -0.079354 -0.055557 -0.085402
polarizability: 2.38516731e+02 4.07516374e+00 2.15143737e+02 2.68774051e-01 5.46112333e-03 1.83593282e+02
1716.lowfreq: -0.0002 0.0001 0.0006 1.1675 12.0683 20.1145 30.4849 45.7917 49.5185
frequency: 29.3893 44.8936 49.1129 66.7844 78.4435 97.5045 115.1546 136.7858 175.7570 183.2627 193.3669 208.5437 228.1331 241.9564 249.1279 253.5127 268.1069 279.5623 288.4512 302.7806 321.8946 336.5686 358.3655 382.3758 400.8973 410.5249 415.8847 420.7477 431.1801 439.1752 463.9779 475.4240 491.6163 493.4852 553.3586 590.6792 658.9663 669.3931 700.9680 776.6083 785.3852 811.5844 812.4141 836.0968 851.9236 863.0058 896.6067 901.6799 910.6623 920.2586 921.9357 926.9132 927.4459 939.3000 939.9237 949.7510 961.9509 962.4456 963.2176 979.2083 1012.8743 1015.1099 1028.5180 1064.4129 1069.7019 1092.7638 1097.0053 1103.1328 1108.7561 1114.3596 1127.6750 1134.3060 1144.5192 1145.3804 1151.0743 1164.2215 1181.3120 1183.3632 1195.8818 1201.4145 1209.8604 1218.1581 1233.1349 1236.9851 1255.5611 1262.5886 1271.3431 1274.7382 1285.6061 1293.9428 1297.2206 1315.8241 1318.1262 1322.2660 1325.6646 1327.5351 1336.9246 1337.5976 1340.2451 1343.4740 1345.6030 1348.8181 1355.0853 1366.0923 1370.4917 1373.7715 1380.0829 1383.7297 1391.7901 1392.5912 1401.7956 1457.0819 1457.3615 1463.0733 1464.0271 1465.4693 1470.1877 1471.4670 1472.8611 1476.8957 1477.9411 1478.5173 1481.7340 1486.0565 1492.3082 1496.7729 1499.0658 1499.8107 1505.3205 2772.7185 2796.7852 2808.1490 2810.0533 2823.6957 2831.7180 2950.5354 2955.2058 2955.8078 2961.8667 2962.2131 2963.0545 2964.2825 2969.2255 2969.5280 2980.5520 2981.0484 2984.1385 2985.9976 2992.8537 2998.2709 3009.9574 3014.3331 3021.2148 3022.3343 3035.2869 3045.3389 3048.1573 3049.8862 3056.8192 3066.5514 3069.0658 3075.3925 3083.2756 3084.3381 3088.6020
redmass: 3.6051 2.6859 3.3532 2.5874 2.9444 3.4243 2.9549 2.8490 2.3574 1.9391 2.5347 1.0551 2.6102 1.3402 1.2731 1.8622 1.5316 3.3161 2.2977 2.0431 2.2449 2.2430 2.2296 2.2256 2.1575 2.3157 2.5018 2.2160 2.0968 2.3800 2.1403 2.7077 3.0718 2.7243 1.9540 2.7867 3.9515 3.6177 4.0060 3.2975 1.5310 2.0039 2.6760 2.9304 2.8051 1.7403 1.9721 1.7080 2.3344 1.1581 1.1920 1.5040 2.0782 1.6362 1.6446 1.5092 1.8943 1.6170 1.8784 2.8049 1.9536 2.0230 2.0210 1.8353 1.8606 1.7558 1.5244 1.9842 2.0028 1.8191 1.8868 2.1369 1.6435 1.7914 2.0466 2.0350 1.8690 1.9231 1.8881 1.7473 1.8477 1.7579 1.4015 1.2720 1.3886 1.2886 1.4625 1.2746 1.4434 1.3872 1.4039 1.5961 1.4478 1.5779 1.4783 1.5064 1.4725 1.4827 1.5015 1.4992 1.3999 1.5230 1.3168 1.5051 1.2171 1.3557 1.2839 1.3197 1.2654 1.2618 1.3989 1.0784 1.0810 1.0686 1.0800 1.0574 1.0848 1.0626 1.0707 1.0574 1.0513 1.0520 1.0890 1.0737 1.0812 1.0650 1.0618 1.0674 1.0772 1.0800 1.0726 1.0724 1.0705 1.0722 1.0721 1.0689 1.0707 1.0362 1.0617 1.0700 1.0472 1.0804 1.0639 1.0613 1.0374 1.0828 1.0368 1.0840 1.0837 1.0879 1.0834 1.0856 1.0952 1.1005 1.1016 1.0913 1.0986 1.0925 1.0987 1.0997 1.1001 1.0997 1.0988 1.0994 1.0987
irintensity: 0.0680 0.0279 0.2643 0.0372 0.0844 1.0311 0.3325 0.3487 0.0972 0.0145 0.1977 0.0218 0.7452 0.0466 0.3817 0.7217 2.1478 6.0412 3.3666 0.4281 0.7338 3.5965 0.8981 0.8172 0.4848 0.0878 0.4104 1.1679 0.0805 0.0469 0.2590 0.3710 0.3151 1.7573 0.7107 1.2938 0.9865 1.4220 9.4324 6.7366 0.1226 1.7164 1.1655 0.6726 0.6975 11.0807 11.7633 4.6200 3.3781 1.6341 4.1349 2.7932 6.4447 1.9312 3.0590 0.7659 3.5929 3.6537 2.0073 14.1656 15.4916 0.4969 7.8878 0.8606 5.8981 23.0031 1.3717 0.7946 13.3568 1.8098 16.2480 5.4589 4.7874 1.2210 52.1821 17.0347 30.5092 9.8107 2.2258 3.5819 6.1189 2.7392 10.2811 14.0950 7.2655 6.2931 14.2855 5.4656 7.9080 6.8847 6.8792 11.6941 1.5185 10.2130 30.6557 3.3266 1.2959 3.5071 1.8346 1.1343 2.3719 4.7157 9.0073 4.4348 21.0581 4.9699 16.2730 19.7920 10.5878 20.7167 2.5319 4.5855 0.8855 5.8434 2.8727 2.1439 6.1431 0.4944 27.2424 8.1914 5.6295 4.3613 10.8019 1.4120 21.5598 14.4669 8.7588 16.4625 7.3689 103.5450 71.5416 79.4547 73.8873 239.0751 202.2346 12.0036 16.3003 29.3673 41.1192 30.2528 35.5024 61.4727 40.6089 35.1437 32.5744 23.6544 24.7951 50.2454 20.2591 42.3858 83.2685 45.3056 84.1234 46.8351 84.3628 52.4780 18.7453 35.9237 78.5227 25.8635 42.1125 2.2707 76.8760 39.9825 39.8170
temp: 298.150 k
press: 1.00000 atm
elementType: 7 7 6 6 6 6 6 6 6 6 6 6 6 6 6 6 6 6 6 6 6 1 1 1 1 1 1 1 1 1 1 1 1 1 1 1 1 1 1 1 1 1 1 1 1 1 1 1 1 1 1 1 1 1 1 1 1
symmnumber: 1
zpe: 1366141.7 jmol-1
zpe.correction: 0.520336 hartree
zpe.thermalcorrener: 0.542417 hartree
zpe.thermalcorrenthalpy: 0.543361 hartree
zpe.thermalcorrgfe: 0.470709 hartree
zpe.sumelectzpe: -853.377026 hartree
zpe.sumelectthermal: -853.354945 hartree
zpe.sumelectthermalent: -853.354001 hartree
zpe.sumelectthermalfe: -853.426653 hartree
dipole: -1.3314 -0.0192 0.0721
dipole: 1.3335
quadrupole: -135.9408 -132.3632 -130.2858
quadrupole: 0.0342 -0.2263 -0.0598
quadrupole: -3.0775 0.5000 2.5775 0.0342 -0.2263 -0.0598
hfenergy: -853.8973616 hartree
pointgroup: C01 [X(C19H36N2)]
dipole: 0.5241385 -0.0019218 -0.0225699 debye
polarizability: 238.5717877|-3.9146047|214.9972883|0.6885023|1.5688505|183.6846742 unknown
InChI: InChI=1S/C19H36N2/c1-15(2)10-20-11-17-13-21(16(3)4)14-18(12-20)19(17)8-6-5-7-9-19/h15-18H,5-14H2,1-4H3
charge 0 multiplicity 1
57 atoms
N  -0.482966 1.7350 0.071392
N  -1.142319 -1.206001 -0.399154
C  1.709472 -0.308026 -0.342987
C  0.803789 -0.29662 0.932639
C  0.715643 0.090119 -1.484754
C  2.887133 0.714484 -0.262479
C  2.350709 -1.70581 -0.615941
C  0.253932 1.125703 1.209533
C  0.144444 1.515446 -1.260559
C  -0.329857 -1.352041 0.820268
C  -0.398136 -0.973469 -1.649189
C  3.960436 0.346764 0.790532
C  3.420263 -2.112185 0.42815
C  4.546268 -1.059159 0.529296
C  -0.814943 3.173328 0.310844
C  -2.26711 -2.147456 -0.50926
C  -3.458916 -1.80776 0.428581
C  -1.546004 3.366762 1.660011
C  -1.693316 3.743769 -0.827054
C  -3.983364 -0.382788 0.143836
C  -4.56848 -2.873364 0.277624
H  1.396091 -0.573924 1.827796
H  1.268063 0.123749 -2.448719
H  2.518704 1.735759 -0.063897
H  3.370039 0.749114 -1.263296
H  2.828037 -1.668693 -1.619354
H  1.58152 -2.4953 -0.669948
H  -0.437106 1.055479 2.070153
H  1.104342 1.777697 1.544976
H  0.960829 2.261338 -1.450873
H  -0.623023 1.692928 -2.036602
H  0.117168 -2.37991 0.904417
H  -0.994249 -1.238796 1.699763
H  -1.118284 -0.617836 -2.413561
H  0.056658 -1.91164 -2.06362
H  4.767365 1.105583 0.776802
H  3.517578 0.380219 1.80711
H  2.944722 -2.240487 1.422046
H  3.843584 -3.099084 0.156052
H  5.113519 -1.042603 -0.424842
H  5.264559 -1.335237 1.32575
H  0.137046 3.777202 0.346031
H  -1.946905 -3.2072 -0.318334
H  -2.63767 -2.113351 -1.554204
H  -3.095931 -1.838907 1.477408
H  -1.87156 4.418039 1.759257
H  -2.44106 2.718105 1.700605
H  -0.906238 3.135583 2.528764
H  -1.165179 3.781424 -1.79498
H  -2.00199 4.775262 -0.578163
H  -2.601837 3.124506 -0.946173
H  -4.452254 -0.337475 -0.859796
H  -4.746104 -0.079524 0.8860
H  -3.144503 0.337183 0.162804
H  -4.962802 -2.881458 -0.757609
H  -5.415739 -2.664216 0.956441
H  -4.191668 -3.889326 0.504761
