program: Orca
programVersion: 5.0.2
elementType: S P O O O O O N N N C C C C C C C C C C C C C C H H H H H H H H H H H H H H H H H H H H
charge: 0
multiplicity: 1
keywords: wb97x-d3
keywords: def2-TZVPP
keywords: def2/J RIJCOSX
keywords: DEFGRID2
keywords: scfconv7
keywords: smallprint printgap noloewdin
keywords: NOSOSCF
formula: C14H20N3O5PS
InChI: InChI=1/C14H20N3O5PS/c1-5-19-14(18)11-9-17-12(15-10(11)4)8-13(16-17)22-23(24,20-6-2)21-7-3/h8-9H,5-7H2,1-4H3
44 atoms
S  3.06337 1.837275 1.011904
P  3.341387 0.090328 0.2788
O  2.095824 -0.52762 -0.574921
O  3.593525 -1.112636 1.283462
O  4.509325 -0.091526 -0.777858
O  -4.89149 -0.014618 -1.909945
O  -5.929293 -0.274553 0.04812
N  -1.245947 -0.37954 -0.378004
N  -2.072002 -0.539927 1.835254
N  -0.107507 -0.357057 -1.077466
C  -1.042113 -0.513921 0.983838
C  -3.548492 -0.306339 -0.034829
C  -2.476567 -0.280007 -0.888018
C  -3.292032 -0.440305 1.374816
C  0.818412 -0.487996 -0.151703
C  0.324164 -0.594739 1.154397
C  -4.37348 -0.468156 2.404265
C  -4.913609 -0.198363 -0.598929
C  4.316057 -0.949325 2.521909
C  4.919001 0.9471 -1.692446
C  -6.137171 0.133413 -2.612582
C  5.790672 -0.71495 2.309119
C  3.942452 1.138793 -2.8257
C  -6.666734 1.54578 -2.534288
H  -2.541714 -0.183481 -1.962038
H  0.860155 -0.713949 2.080257
H  -3.918205 -0.544183 3.389094
H  -4.984933 0.433195 2.373876
H  -5.04236 -1.317044 2.265979
H  4.143193 -1.877969 3.062943
H  3.86507 -0.13679 3.095361
H  5.887904 0.617555 -2.063476
H  5.069707 1.875746 -1.138452
H  -5.898472 -0.129814 -3.641886
H  -6.86616 -0.589489 -2.244009
H  6.288725 -0.719039 3.279522
H  5.993931 0.250186 1.843325
H  6.239542 -1.500035 1.700625
H  3.756727 0.206438 -3.358867
H  4.365912 1.850585 -3.535491
H  2.98905 1.544903 -2.486673
H  -6.936271 1.832683 -1.5184
H  -5.94195 2.263909 -2.918791
H  -7.565288 1.620699 -3.148016
elementType: S P O N C H
totalener: -1825.71389902 hartree
nucrepener: 2449.50263330 hartree
electener: -4275.21653232 hartree
oneelecener: -7375.81897299 hartree
twoeener: 3100.60244067 hartree
cpcmener: -0.02953906 hartree
kineticenergy: 1819.70863036 hartree
xcener: -138.287993221124 hartree
chargesum: -0.0000000
charge: -0.425958 0.745905 -0.313457 -0.345288 -0.340984 -0.287456 -0.456782 0.162190 -0.340998 -0.358779 0.206793 -0.133725 0.072106 0.191996 0.276292 -0.317692 -0.252885 0.490370 0.034030 0.035300 0.040871 -0.238189 -0.235576 -0.254151 0.160203 0.160286 0.095487 0.103983 0.104171 0.110841 0.095267 0.110026 0.093654 0.106418 0.090744 0.098277 0.080584 0.092843 0.091290 0.098045 0.080089 0.090122 0.088010 0.095727
qa: -0.4260 0.7459 -0.3135 -0.3453 -0.3410 -0.2875 -0.4568 0.1622 -0.3410 -0.3588 0.2068 -0.1337 0.0721 0.1920 0.2763 -0.3177 -0.2529 0.4904 0.0340 0.0353 0.0409 -0.2382 -0.2356 -0.2542 0.1602 0.1603 0.0955 0.1040 0.1042 0.1108 0.0953 0.1100 0.0937 0.1064 0.0907 0.0983 0.0806 0.0928 0.0913 0.0980 0.0801 0.0901 0.0880 0.0957
va: 1.9973 5.4929 2.1554 2.1112 2.1194 2.1284 2.0505 3.4126 3.1401 2.7896 4.1058 3.7500 4.0458 3.8705 4.1708 3.9600 3.9133 4.1156 3.8495 3.8483 3.8436 3.9156 3.9035 3.9196 1.0262 1.0077 1.0217 1.0043 1.0049 0.9911 1.0087 0.9919 1.0119 0.9957 1.0107 1.0085 1.0150 1.0060 1.0062 1.0089 1.0163 1.0126 1.0043 1.0070
dispcorr: -0.019973888 hartree
energy: -1825.733872905404
dipole: -3.09875 3.36442 0.26567 4.22010 -4.33760 -0.11750 -5.09108 4.06155 -1.02953
magnitude: 1.06973 au
magnitude: 2.71904 debye
