program: Orca
programVersion: 5.0.2
elementType: S P O O O O O N N N C C C C C C C C C C C C C C H H H H H H H H H H H H H H H H H H H H
charge: 0
multiplicity: 1
keywords: wb97x-d3
keywords: def2-TZVPP
keywords: def2/J RIJCOSX
keywords: DEFGRID2
keywords: scfconv7
keywords: smallprint printgap noloewdin
keywords: NOSOSCF
formula: C14H20N3O5PS
InChI: InChI=1/C14H20N3O5PS/c1-5-19-14(18)11-9-17-12(15-10(11)4)8-13(16-17)22-23(24,20-6-2)21-7-3/h8-9H,5-7H2,1-4H3
44 atoms
S  2.452015 2.088479 1.755217
P  3.045033 0.556261 0.779591
O  2.257052 -0.851557 1.063003
O  4.499472 0.094507 1.200029
O  3.000439 0.598099 -0.809215
O  -4.23609 1.026425 -1.236187
O  -5.600424 -0.673661 -0.775376
N  -1.000511 -0.699256 0.214903
N  -2.159147 -2.676575 0.802293
N  0.208353 -0.134924 0.255047
C  -1.023548 -1.971737 0.761476
C  -3.278136 -0.832521 -0.23824
C  -2.100845 -0.132314 -0.277491
C  -3.261277 -2.153797 0.328266
C  0.952161 -1.051779 0.831552
C  0.267894 -2.223709 1.177275
C  -4.477963 -3.014529 0.417385
C  -4.497804 -0.18312 -0.768252
C  5.289095 -0.876558 0.475254
C  2.967116 1.82125 -1.578645
C  -5.311489 1.816446 -1.762982
C  6.305653 -0.190317 -0.402384
C  1.564566 2.150425 -2.021895
C  -4.727134 3.14355 -2.173908
H  -1.985872 0.864402 -0.678006
H  0.654496 -3.107498 1.655317
H  -4.203715 -3.968897 0.8612
H  -5.251204 -2.556391 1.033823
H  -4.915085 -3.200173 -0.563366
H  4.65214 -1.546005 -0.106083
H  5.779148 -1.477771 1.240379
H  3.616146 1.640798 -2.434761
H  3.397798 2.641727 -1.002041
H  -5.761506 1.303045 -2.615299
H  -6.081643 1.946347 -0.999803
H  5.836634 0.377002 -1.20669
H  6.95002 -0.943085 -0.85851
H  6.939135 0.484284 0.174342
H  1.10973 1.319463 -2.561739
H  1.600998 3.006734 -2.696802
H  0.925476 2.411836 -1.17989
H  -4.288852 3.668576 -1.324469
H  -3.961772 3.025609 -2.941928
H  -5.51527 3.774592 -2.58381
elementType: S P O N C H
totalener: -1825.71222094 hartree
nucrepener: 2484.48993821 hartree
electener: -4310.20215915 hartree
oneelecener: -7445.53868711 hartree
twoeener: 3135.33652796 hartree
cpcmener: -0.03134125 hartree
kineticenergy: 1819.72385520 hartree
xcener: -138.290626032226 hartree
chargesum: -0.0000000
charge: -0.422753 0.714188 -0.310884 -0.340546 -0.331305 -0.281367 -0.456972 0.181452 -0.347512 -0.406426 0.205200 -0.139090 0.080368 0.195370 0.336238 -0.325679 -0.252584 0.478635 0.046035 0.051419 0.034043 -0.245428 -0.233677 -0.257168 0.163422 0.166219 0.096350 0.104628 0.104263 0.096701 0.103603 0.104789 0.091802 0.098524 0.098201 0.082000 0.094731 0.089387 0.084716 0.103506 0.074630 0.088601 0.088875 0.093494
qa: -0.4228 0.7142 -0.3109 -0.3405 -0.3313 -0.2814 -0.4570 0.1815 -0.3475 -0.4064 0.2052 -0.1391 0.0804 0.1954 0.3362 -0.3257 -0.2526 0.4786 0.0460 0.0514 0.0340 -0.2454 -0.2337 -0.2572 0.1634 0.1662 0.0963 0.1046 0.1043 0.0967 0.1036 0.1048 0.0918 0.0985 0.0982 0.0820 0.0947 0.0894 0.0847 0.1035 0.0746 0.0886 0.0889 0.0935
va: 2.0167 5.5189 2.1693 2.1260 2.0642 2.1245 2.0577 3.4162 3.1306 2.7941 4.0299 3.7659 4.0228 3.8632 4.0608 3.8847 3.9179 4.1152 3.8589 3.8313 3.8479 3.9339 3.9177 3.9666 1.0169 0.9999 1.0219 1.0040 1.0040 0.9998 0.9938 0.9919 1.0104 0.9952 0.9959 1.0064 1.0086 1.0035 1.0084 1.0099 1.0193 1.0028 1.0028 1.0074
dispcorr: -0.020408702 hartree
energy: -1825.732629639304
dipole: -2.97886 3.36717 0.38831 8.32848 -7.98486 0.34363 -18.73680 16.23388 -2.50293
magnitude: 2.55607 au
magnitude: 6.49702 debye
