program: Orca
programVersion: 5.0.2
elementType: S P O O O O O N N N C C C C C C C C C C C C C C H H H H H H H H H H H H H H H H H H H H
charge: 0
multiplicity: 1
keywords: wb97x-d3
keywords: def2-TZVPP
keywords: def2/J RIJCOSX
keywords: DEFGRID2
keywords: scfconv7
keywords: smallprint printgap noloewdin
keywords: NOSOSCF
formula: C14H20N3O5PS
InChI: InChI=1/C14H20N3O5PS/c1-5-19-14(18)11-9-17-12(15-10(11)4)8-13(16-17)22-23(24,20-6-2)21-7-3/h8-9H,5-7H2,1-4H3
44 atoms
S  2.393446 2.062768 2.007471
P  3.04393 0.646206 0.902429
O  2.312828 -0.814605 1.111229
O  4.523119 0.217829 1.246889
O  3.02743 0.835582 -0.674206
O  -4.158101 1.047751 -1.289611
O  -5.524661 -0.642847 -0.802793
N  -0.929385 -0.673724 0.204269
N  -2.090328 -2.659425 0.757312
N  0.278045 -0.106669 0.271104
C  -0.956732 -1.950389 0.74065
C  -3.201374 -0.80832 -0.278992
C  -2.02528 -0.105037 -0.297583
C  -3.187807 -2.135429 0.274353
C  1.015354 -1.025424 0.856889
C  0.327667 -2.201836 1.178884
C  -4.40199 -3.002382 0.337801
C  -4.419931 -0.156922 -0.809399
C  5.344347 -0.684127 0.46839
C  2.258158 1.827737 -1.387835
C  -5.2428 1.837152 -1.801004
C  6.283255 0.082319 -0.429163
C  1.690874 1.200532 -2.633868
C  -4.66755 3.160874 -2.234784
H  -1.908261 0.896199 -0.686106
H  0.706138 -3.088864 1.65747
H  -4.835134 -3.166849 -0.648403
H  -4.126137 -3.965606 0.760971
H  -5.179033 -2.561292 0.961918
H  4.726866 -1.380348 -0.102132
H  5.899514 -1.266208 1.203077
H  2.933621 2.649218 -1.63021
H  1.466781 2.218943 -0.749182
H  -5.711096 1.318026 -2.639832
H  -5.996749 1.973835 -1.02296
H  5.75489 0.608278 -1.2237
H  6.977717 -0.617009 -0.896699
H  6.871865 0.805285 0.136614
H  1.003455 0.38982 -2.393473
H  2.474839 0.813801 -3.285908
H  1.138315 1.956927 -3.192479
H  -5.466207 3.787593 -2.631051
H  -4.210757 3.693149 -1.39982
H  -3.920603 3.037985 -3.019848
elementType: S P O N C H
totalener: -1825.71267438 hartree
nucrepener: 2491.22547249 hartree
electener: -4316.93814688 hartree
oneelecener: -7458.69797692 hartree
twoeener: 3141.75983005 hartree
cpcmener: -0.03024887 hartree
kineticenergy: 1819.71657686 hartree
xcener: -138.290101715880 hartree
chargesum: 0.0000000
charge: -0.424760 0.717786 -0.314030 -0.344175 -0.329071 -0.282213 -0.456830 0.177037 -0.347695 -0.419174 0.207489 -0.135926 0.075017 0.197786 0.353111 -0.327150 -0.252112 0.476985 0.044926 0.047229 0.034818 -0.247024 -0.252696 -0.256679 0.163539 0.166258 0.104177 0.096384 0.104707 0.100381 0.104883 0.118141 0.097323 0.098157 0.098478 0.083204 0.094273 0.088257 0.083415 0.093354 0.091771 0.093302 0.088442 0.088907
qa: -0.4248 0.7178 -0.3140 -0.3442 -0.3291 -0.2822 -0.4568 0.1770 -0.3477 -0.4192 0.2075 -0.1359 0.0750 0.1978 0.3531 -0.3271 -0.2521 0.4770 0.0449 0.0472 0.0348 -0.2470 -0.2527 -0.2567 0.1635 0.1663 0.1042 0.0964 0.1047 0.1004 0.1049 0.1181 0.0973 0.0982 0.0985 0.0832 0.0943 0.0883 0.0834 0.0934 0.0918 0.0933 0.0884 0.0889
va: 2.0154 5.5168 2.1519 2.1357 2.0659 2.1258 2.0575 3.4343 3.1303 2.7975 4.0292 3.7600 4.0177 3.8615 4.0366 3.8850 3.9173 4.1164 3.8505 3.7836 3.8471 3.9287 3.9441 3.9672 1.0180 1.0005 1.0040 1.0219 1.0041 0.9988 0.9932 0.9980 1.0201 0.9952 0.9960 1.0111 1.0079 1.0041 1.0105 1.0033 1.0068 1.0072 1.0028 1.0028
dispcorr: -0.020437793 hartree
energy: -1825.733112177082
dipole: -4.10353 4.07482 -0.02871 6.53017 -6.25316 0.27701 -20.85102 18.22052 -2.63050
magnitude: 2.64520 au
magnitude: 6.72357 debye
