program: Orca
programVersion: 5.0.2
elementType: S P O O O O O N N N C C C C C C C C C C C C C C H H H H H H H H H H H H H H H H H H H H
charge: 0
multiplicity: 1
keywords: wb97x-d3
keywords: def2-TZVPP
keywords: def2/J RIJCOSX
keywords: DEFGRID2
keywords: scfconv7
keywords: smallprint printgap noloewdin
keywords: NOSOSCF
formula: C14H20N3O5PS
InChI: InChI=1/C14H20N3O5PS/c1-5-19-14(18)11-9-17-12(15-10(11)4)8-13(16-17)22-23(24,20-6-2)21-7-3/h8-9H,5-7H2,1-4H3
44 atoms
S  2.527729 2.026854 1.689011
P  3.083837 0.441063 0.772268
O  2.263768 -0.932306 1.130962
O  4.504934 -0.164543 1.139407
O  3.090683 0.460883 -0.815923
O  -4.069869 0.967958 -1.692843
O  -5.540843 -0.465937 -0.819078
N  -0.949271 -0.698767 0.127665
N  -2.225133 -2.562033 0.835136
N  0.287088 -0.193046 0.170818
C  -1.056524 -1.914145 0.782173
C  -3.21818 -0.757148 -0.385756
C  -2.005882 -0.121993 -0.448327
C  -3.284262 -2.028871 0.283138
C  0.960155 -1.089415 0.860569
C  0.202167 -2.189997 1.27594
C  -4.539902 -2.831255 0.382731
C  -4.403435 -0.094148 -0.974831
C  5.625712 0.675348 1.485193
C  2.42941 1.44579 -1.635523
C  -5.116718 1.779027 -2.2534
C  6.133523 1.487788 0.318629
C  1.8934 0.763352 -2.86709
C  -5.676018 2.75471 -1.244318
H  -1.830304 0.832509 -0.923486
H  0.52055 -3.045966 1.846122
H  -4.312231 -3.784915 0.853497
H  -5.295457 -2.323085 0.981331
H  -4.978435 -3.021843 -0.596437
H  6.386875 -0.018886 1.836219
H  5.346761 1.31964 2.321213
H  3.165809 2.208464 -1.893606
H  1.627665 1.926928 -1.076096
H  -4.63711 2.308718 -3.074776
H  -5.898026 1.146513 -2.676078
H  5.420789 2.252707 0.007229
H  6.371121 0.858447 -0.539109
H  7.047958 2.000143 0.620314
H  1.141037 0.01697 -2.611001
H  2.685294 0.279724 -3.439817
H  1.424401 1.507337 -3.511741
H  -6.404082 3.397903 -1.739758
H  -6.185125 2.254242 -0.421276
H  -4.894356 3.393828 -0.833071
elementType: S P O N C H
totalener: -1825.71221802 hartree
nucrepener: 2488.95211920 hartree
electener: -4314.66433722 hartree
oneelecener: -7454.50238749 hartree
twoeener: 3139.83805027 hartree
cpcmener: -0.02822547 hartree
kineticenergy: 1819.71198703 hartree
xcener: -138.290774716122 hartree
chargesum: 0.0000000
charge: -0.436993 0.747267 -0.316223 -0.339179 -0.337420 -0.290084 -0.456295 0.175276 -0.347199 -0.419164 0.209990 -0.138281 0.072022 0.192856 0.340540 -0.329225 -0.251752 0.480229 0.027650 0.057092 0.041194 -0.240448 -0.249326 -0.254032 0.161938 0.167167 0.096572 0.104467 0.105027 0.109506 0.096043 0.114796 0.095288 0.107222 0.091289 0.078795 0.092610 0.099854 0.082068 0.092464 0.090882 0.096209 0.090533 0.088777
qa: -0.4370 0.7473 -0.3162 -0.3392 -0.3374 -0.2901 -0.4563 0.1753 -0.3472 -0.4192 0.2100 -0.1383 0.0720 0.1929 0.3405 -0.3292 -0.2518 0.4802 0.0277 0.0571 0.0412 -0.2404 -0.2493 -0.2540 0.1619 0.1672 0.0966 0.1045 0.1050 0.1095 0.0960 0.1148 0.0953 0.1072 0.0913 0.0788 0.0926 0.0999 0.0821 0.0925 0.0909 0.0962 0.0905 0.0888
va: 1.9858 5.4980 2.1983 2.1210 2.0779 2.1273 2.0498 3.4337 3.1306 2.7933 4.0286 3.7480 4.0232 3.8622 4.0508 3.8871 3.9156 4.1257 3.8617 3.7834 3.8383 3.8874 3.9544 3.9233 1.0216 1.0002 1.0218 1.0055 1.0034 0.9922 1.0106 0.9947 1.0167 0.9958 1.0111 1.0155 1.0066 1.0083 1.0102 1.0042 1.0060 1.0068 1.0116 1.0043
dispcorr: -0.020488875 hartree
energy: -1825.732706895710
dipole: -5.54765 5.66177 0.11412 11.41930 -10.18080 1.23850 -15.12874 13.17670 -1.95204
magnitude: 2.31460 au
magnitude: 5.88325 debye
