program: Orca
programVersion: 5.0.2
elementType: S P O O O O O N N N C C C C C C C C C C C C C C H H H H H H H H H H H H H H H H H H H H
charge: 0
multiplicity: 1
keywords: wb97x-d3
keywords: def2-TZVPP
keywords: def2/J RIJCOSX
keywords: DEFGRID2
keywords: scfconv7
keywords: smallprint printgap noloewdin
keywords: NOSOSCF
formula: C14H20N3O5PS
InChI: InChI=1/C14H20N3O5PS/c1-5-19-14(18)11-9-17-12(15-10(11)4)8-13(16-17)22-23(24,20-6-2)21-7-3/h8-9H,5-7H2,1-4H3
44 atoms
S  2.672254 2.132474 0.834823
P  3.202593 0.421106 0.161308
O  2.356919 -0.878523 0.682093
O  4.660333 -0.079566 0.547467
O  3.153347 0.167753 -1.401883
O  -4.2836 1.156894 -1.113964
O  -5.606788 -0.5579 -0.56978
N  -0.95979 -0.631296 0.10936
N  -2.171737 -2.284643 1.293857
N  0.283943 -0.193968 -0.113965
C  -1.005548 -1.717258 0.967895
C  -3.281407 -0.647597 -0.054634
C  -2.074422 -0.090646 -0.386789
C  -3.284577 -1.796064 0.810595
C  1.022153 -0.99716 0.620959
C  0.303188 -1.973472 1.31965
C  -4.53579 -2.497781 1.225911
C  -4.516694 -0.041292 -0.599848
C  5.331423 0.318202 1.761545
C  3.277812 1.215625 -2.387134
C  -5.358787 1.863029 -1.75488
C  4.749221 -0.328247 2.993823
C  1.965959 1.411883 -3.10031
C  -5.567047 1.402569 -3.178387
H  -1.94426 0.765027 -1.033273
H  0.678989 -2.739548 1.976049
H  -4.278661 -3.295468 1.919102
H  -5.23697 -1.823351 1.716934
H  -5.052493 -2.935902 0.372509
H  5.311305 1.406589 1.843274
H  6.365728 0.012295 1.614086
H  4.059492 0.892506 -3.073329
H  3.608485 2.142764 -1.916472
H  -6.27245 1.774443 -1.166299
H  -5.047717 2.905915 -1.730537
H  3.736535 0.018168 3.202515
H  5.367134 -0.062423 3.852522
H  4.739488 -1.415327 2.914285
H  1.611549 0.484165 -3.548985
H  2.100817 2.138682 -3.901785
H  1.197043 1.791617 -2.428443
H  -6.311064 2.044304 -3.652194
H  -4.647018 1.478217 -3.758333
H  -5.930754 0.37711 -3.234347
elementType: S P O N C H
totalener: -1825.71243350 hartree
nucrepener: 2480.22651678 hartree
electener: -4305.93895029 hartree
oneelecener: -7437.48504805 hartree
twoeener: 3131.54609776 hartree
cpcmener: -0.02862993 hartree
kineticenergy: 1819.72130995 hartree
xcener: -138.291240152505 hartree
chargesum: 0.0000000
charge: -0.437969 0.758333 -0.312701 -0.344701 -0.340486 -0.289108 -0.456856 0.174654 -0.345948 -0.404508 0.207698 -0.135274 0.076341 0.191447 0.333134 -0.321851 -0.254710 0.480230 0.028835 0.052245 0.039920 -0.238355 -0.243356 -0.252875 0.161074 0.166734 0.095870 0.105832 0.104443 0.094480 0.108340 0.105594 0.083133 0.091052 0.107858 0.080001 0.098243 0.091286 0.091701 0.098701 0.076130 0.096447 0.088073 0.090872
qa: -0.4380 0.7583 -0.3127 -0.3447 -0.3405 -0.2891 -0.4569 0.1747 -0.3459 -0.4045 0.2077 -0.1353 0.0763 0.1914 0.3331 -0.3219 -0.2547 0.4802 0.0288 0.0522 0.0399 -0.2384 -0.2434 -0.2529 0.1611 0.1667 0.0959 0.1058 0.1044 0.0945 0.1083 0.1056 0.0831 0.0911 0.1079 0.0800 0.0982 0.0913 0.0917 0.0987 0.0761 0.0964 0.0881 0.0909
va: 1.9841 5.4903 2.1740 2.1216 2.1177 2.1270 2.0488 3.4147 3.1295 2.7943 4.0305 3.7477 4.0301 3.8649 4.0536 3.8897 3.9173 4.1202 3.8630 3.8493 3.8413 3.8886 3.9212 3.9232 1.0217 1.0001 1.0221 1.0027 1.0054 1.0103 0.9919 0.9961 1.0143 1.0109 0.9956 1.0180 1.0088 1.0064 1.0044 1.0103 1.0147 1.0067 1.0045 1.0112
dispcorr: -0.019892509 hartree
energy: -1825.732326012052
dipole: -7.93394 8.10927 0.17533 5.41122 -4.52110 0.89012 -9.06573 7.98685 -1.07888
magnitude: 1.40962 au
magnitude: 3.58297 debye
