program: Orca
programVersion: 5.0.2
elementType: S P O O O O O N N N C C C C C C C C C C C C C C H H H H H H H H H H H H H H H H H H H H
charge: 0
multiplicity: 1
keywords: wb97x-d3
keywords: def2-TZVPP
keywords: def2/J RIJCOSX
keywords: DEFGRID2
keywords: scfconv7
keywords: smallprint printgap noloewdin
keywords: NOSOSCF
formula: C14H20N3O5PS
InChI: InChI=1/C14H20N3O5PS/c1-5-19-14(18)11-9-17-12(15-10(11)4)8-13(16-17)22-23(24,20-6-2)21-7-3/h8-9H,5-7H2,1-4H3
44 atoms
S  2.609043 1.921792 1.578268
P  3.057859 0.308478 0.650638
O  2.184217 -1.021839 1.041162
O  4.455634 -0.367418 0.978093
O  3.030833 0.330947 -0.93665
O  -4.155848 0.957304 -1.705726
O  -5.650616 -0.392776 -0.74369
N  -1.046138 -0.719847 0.115898
N  -2.357272 -2.515373 0.927831
N  0.206245 -0.250505 0.106593
C  -1.172292 -1.904913 0.820877
C  -3.327923 -0.733684 -0.343197
C  -2.100025 -0.136053 -0.457818
C  -3.414069 -1.974589 0.378581
C  0.86925 -1.140495 0.813689
C  0.090068 -2.199185 1.293479
C  -4.688851 -2.736056 0.539176
C  -4.506142 -0.062184 -0.936591
C  5.615702 0.399649 1.360179
C  2.350144 1.307695 -1.750124
C  -5.187657 1.774383 -2.285141
C  6.177141 1.222425 0.226717
C  3.35621 2.090343 -2.553938
C  -5.718449 2.796458 -1.307406
H  -1.909517 0.794007 -0.973571
H  0.398272 -3.041425 1.889013
H  -5.415929 -2.182457 1.132679
H  -5.155325 -2.954598 -0.420985
H  -4.476705 -3.675522 1.04452
H  6.336184 -0.345893 1.691969
H  5.365285 1.028578 2.216659
H  1.7506 1.96958 -1.124513
H  1.672162 0.751034 -2.396324
H  -4.700587 2.264891 -3.12635
H  -5.985986 1.146304 -2.682443
H  6.390845 0.611004 -0.650098
H  7.113682 1.675668 0.554267
H  5.508798 2.033188 -0.064578
H  4.001577 2.691061 -1.912488
H  2.82694 2.769323 -3.22381
H  3.980113 1.43821 -3.165802
H  -4.918332 3.426519 -0.917906
H  -6.428384 3.443805 -1.823838
H  -6.240839 2.338078 -0.468276
elementType: S P O N C H
totalener: -1825.71236732 hartree
nucrepener: 2473.74040772 hartree
electener: -4299.45277504 hartree
oneelecener: -7424.13532039 hartree
twoeener: 3124.68254535 hartree
cpcmener: -0.02834854 hartree
kineticenergy: 1819.71030376 hartree
xcener: -138.291010750515 hartree
chargesum: -0.0000000
charge: -0.437327 0.740497 -0.314974 -0.339760 -0.332796 -0.289687 -0.456681 0.172426 -0.347040 -0.416523 0.210191 -0.138603 0.075207 0.192053 0.340039 -0.327795 -0.251010 0.481012 0.031614 0.075802 0.040897 -0.242129 -0.252589 -0.254007 0.160164 0.167068 0.104456 0.104848 0.096158 0.109062 0.095915 0.087518 0.097154 0.107004 0.091371 0.094071 0.102255 0.074299 0.083792 0.098500 0.091951 0.088621 0.096217 0.090758
qa: -0.4373 0.7405 -0.3150 -0.3398 -0.3328 -0.2897 -0.4567 0.1724 -0.3470 -0.4165 0.2102 -0.1386 0.0752 0.1921 0.3400 -0.3278 -0.2510 0.4810 0.0316 0.0758 0.0409 -0.2421 -0.2526 -0.2540 0.1602 0.1671 0.1045 0.1048 0.0962 0.1091 0.0959 0.0875 0.0972 0.1070 0.0914 0.0941 0.1023 0.0743 0.0838 0.0985 0.0920 0.0886 0.0962 0.0908
va: 1.9850 5.5046 2.1987 2.1193 2.0873 2.1268 2.0497 3.4299 3.1301 2.7942 4.0278 3.7485 4.0306 3.8646 4.0541 3.8853 3.9161 4.1245 3.8565 3.7962 3.8394 3.8893 3.9552 3.9214 1.0231 0.9999 1.0056 1.0034 1.0219 0.9924 1.0101 1.0178 0.9965 0.9959 1.0106 1.0057 1.0098 1.0134 1.0024 1.0092 1.0031 1.0043 1.0067 1.0119
dispcorr: -0.020283741 hartree
energy: -1825.732651058611
dipole: -2.31359 2.46233 0.14873 14.09392 -12.87380 1.22012 -14.17095 12.22495 -1.94600
magnitude: 2.30168 au
magnitude: 5.85041 debye
