program: Gaussian 09
title: 000065996
version: EM64L-G09RevD.01
frameworkgroup: C1[X(C21H34N2O)]
method: RPBEPBE
basis: SDD
operation: Freq
keyword: #p
keyword: freq=noraman
keyword: PBEPBE/SDD
title: #p freq=noraman PBEPBE/SDD
converged: YES YES NO NO
title: Mulliken charges:
elementType: O N N C C C C C C C C C C C C C C C C C C C C C H H H H H H H H H H H H H H H H H H H H H H H H H H H H H H H H H H
charge: -0.284580 -0.040971 -0.130441 0.151162 -0.525758 -0.468326 -0.403413 -0.452464 0.377078 0.148582 -0.367969 -0.384983 -0.366259 -0.417312 -0.361856 -0.346739 -0.353366 -0.656683 -0.249936 -0.250244 -0.246847 -0.354775 -0.661569 -0.696697 0.237971 0.205876 0.222555 0.243579 0.176413 0.213678 0.252671 0.192539 0.167235 0.206690 0.206407 0.204747 0.254369 0.245614 0.185065 0.185137 0.258383 0.203798 0.189163 0.185905 0.229998 0.274411 0.230271 0.225983 0.223686 0.228252 0.195224 0.194346 0.250634 0.203697 0.215763 0.210223 0.215029 0.209055
chargesum: 0.00000
title: Mulliken charges with hydrogens summed into heavy atoms:
elementType: O N N C C C C C C C C C C C C C C C C C C C C C
charge: -0.284580 -0.040971 -0.130441 0.151162 -0.081911 -0.002192 -0.013322 -0.007255 0.377078 0.148582 0.005956 0.026171 -0.111890 -0.171697 0.008347 0.115442 0.021702 0.077997 -0.023953 -0.026558 -0.018595 0.034795 0.008524 -0.062391
chargesum: -0.00014
polarizability: 2.84473160e+02 6.01636562e+00 2.37886012e+02 -8.60969276e+00 8.12202522e+00 2.00784276e+02
1716.lowfreq: -10.1770 -5.8436 -3.9939 -2.2371 -0.6985 -0.1262 12.0036 26.5783 37.4699
frequency: 10.9175 25.8033 37.1386 43.1941 46.9960 50.0354 60.2145 75.1314 86.5600 102.7888 104.4326 113.8364 131.8137 142.6568 151.5244 178.2650 192.2401 203.5130 214.4675 223.3904 233.1785 244.0885 283.8985 295.4652 301.1730 320.7774 342.5653 357.1342 383.7365 404.7970 409.1541 414.8764 440.0179 455.3708 472.9124 491.4352 528.5158 560.8542 579.1471 613.4708 619.3674 669.1309 706.9661 709.4495 723.7989 742.4018 753.5578 763.1116 772.1302 780.1562 792.5753 829.8421 854.5096 879.3474 887.9605 892.2634 905.2452 924.5491 938.8413 977.2942 984.3865 987.1381 989.3150 995.5105 1003.0860 1011.5034 1021.0664 1035.4812 1041.7590 1058.2599 1059.6668 1065.2636 1073.9134 1079.8233 1082.4053 1087.6479 1100.9059 1115.2214 1116.9387 1121.0011 1132.0049 1153.0619 1167.8256 1172.6675 1181.2748 1196.0076 1202.0583 1220.0016 1225.7815 1232.0546 1238.1831 1249.1210 1264.1969 1281.3197 1285.4435 1285.8449 1287.9203 1294.7910 1298.6506 1319.7440 1324.8270 1336.3177 1337.9252 1344.7052 1353.1091 1354.3337 1369.7591 1373.9013 1379.2317 1381.4478 1390.8700 1391.0937 1431.3244 1435.3815 1443.2012 1452.7553 1458.4381 1463.7305 1465.6703 1467.8771 1470.1258 1474.2146 1478.1357 1480.9095 1481.4908 1482.6671 1486.3949 1488.3317 1490.8859 1492.4084 1495.2555 1557.8537 1586.0143 1608.9284 2804.6067 2822.9492 2949.5568 2954.4327 2965.7215 2966.2677 2971.4479 2973.4449 2983.7721 2986.0894 2987.5277 2994.6099 3001.6038 3002.3546 3003.4165 3008.7483 3011.0203 3026.8905 3043.4843 3045.1174 3048.7656 3062.5184 3067.8694 3068.5909 3069.8746 3081.4690 3085.9480 3102.2812 3117.6215 3122.4009 3123.0319 3136.5867 3146.3881 3161.8807
redmass: 4.2588 2.4628 1.9290 3.3166 3.5120 3.6033 3.6214 3.8354 3.3735 3.5892 1.8394 3.2170 2.8059 3.1094 2.3998 1.8898 3.1795 2.4960 1.2956 1.8565 1.1175 2.1876 3.1214 3.7690 3.2519 2.4571 2.4076 2.0208 2.8670 2.9948 3.6189 3.1625 3.4600 2.7749 2.6941 3.0583 3.4941 3.0227 2.3292 5.4854 5.1078 4.9665 1.7892 6.0336 1.0681 1.1738 3.1845 2.3352 2.0551 1.2441 1.1943 2.0876 1.2479 1.3550 2.0003 1.9168 2.0323 1.6950 2.2531 1.3798 1.2125 2.4379 5.3954 1.3327 2.6610 3.1759 2.6636 2.5106 2.4485 2.4048 1.8061 2.3121 1.9463 2.0963 1.9477 1.8564 2.8224 2.0148 1.5815 2.2629 2.0747 2.2502 2.1718 1.0562 1.9166 1.1349 1.5659 3.0010 1.3245 1.4066 1.5032 1.3091 1.3647 1.0971 1.4680 1.3259 1.2325 1.1855 1.3629 1.3450 1.3571 1.3349 1.3852 1.3450 1.6565 1.2634 1.3901 5.9163 1.3091 1.3677 1.2184 2.0543 1.5551 1.4962 1.1757 1.1644 1.0805 1.0667 1.0762 1.0697 1.0967 1.0757 1.0423 1.1517 1.7174 1.0891 1.0969 1.0881 1.0912 1.0668 1.0839 5.2461 5.9214 5.9360 1.0706 1.0715 1.0588 1.0588 1.0403 1.0589 1.0370 1.0600 1.0357 1.0969 1.0635 1.0708 1.0947 1.0643 1.0689 1.0853 1.0793 1.1035 1.0981 1.1033 1.1005 1.0992 1.1006 1.0989 1.0993 1.0995 1.0981 1.1021 1.0858 1.0951 1.0873 1.0919 1.0951 1.1013
irintensity: 0.0167 0.2144 0.5395 0.1886 0.0408 0.7638 0.2707 1.6985 0.1585 1.6378 0.3521 0.6960 0.5164 0.4035 1.0687 0.8909 2.7307 0.3910 0.8480 0.6191 0.0385 1.3590 0.2809 0.2830 0.8754 3.3874 6.1573 0.3889 0.3994 2.9522 14.5032 6.6313 3.3758 0.2005 1.7209 1.4244 6.9940 13.6062 0.8352 3.7985 9.3425 1.4896 48.8765 7.4339 10.7227 0.2506 6.6982 10.8271 33.6253 5.8485 3.0289 8.3608 0.5779 0.7202 3.7764 5.4601 4.1251 4.7184 3.0234 0.0530 1.6237 21.4496 0.3360 0.5495 1.6399 0.9388 13.9776 22.0433 5.6348 17.2077 46.3728 3.9288 5.3331 6.8696 15.0117 11.3922 30.0072 3.4300 1.5076 17.6257 31.0337 20.6618 6.6298 0.0598 6.8738 0.4044 1.2425 6.9588 2.9891 9.5410 3.2768 1.2598 13.4183 18.7542 47.3182 34.1756 1.9415 3.6041 4.9196 1.1984 4.0079 11.9448 1.1444 4.6051 1.4168 0.7973 18.2417 0.1746 21.0209 7.4571 12.2896 43.9317 16.5044 4.8455 10.1110 35.7793 1.6453 0.2045 1.3721 2.3418 24.4389 0.3380 12.0164 27.2625 14.2640 3.8071 10.6381 13.6745 14.1422 11.6439 17.3731 199.1492 1.0557 11.0104 78.8348 110.8201 2.7269 14.0054 47.4688 64.4803 35.4972 59.8498 27.6662 1.0733 30.3862 24.8196 6.8650 53.6763 11.3534 39.0382 44.5348 14.0455 30.0512 83.8988 77.7564 20.1822 95.7488 16.1873 56.2956 9.1130 37.9291 26.2837 4.2368 4.0115 0.9490 15.2725 39.0932 24.0073
temp: 298.150 k
press: 1.00000 atm
elementType: 8 7 7 6 6 6 6 6 6 6 6 6 6 6 6 6 6 6 6 6 6 6 6 6 1 1 1 1 1 1 1 1 1 1 1 1 1 1 1 1 1 1 1 1 1 1 1 1 1 1 1 1 1 1 1 1 1 1
symmnumber: 1
zpe: 1340392.0 jmol-1
zpe.correction: 0.510528 hartree
zpe.thermalcorrener: 0.536943 hartree
zpe.thermalcorrenthalpy: 0.537887 hartree
zpe.thermalcorrgfe: 0.451303 hartree
zpe.sumelectzpe: -1003.466116 hartree
zpe.sumelectthermal: -1003.439702 hartree
zpe.sumelectthermalent: -1003.438758 hartree
zpe.sumelectthermalfe: -1003.525342 hartree
dipole: 0.9397 1.7994 2.8308
dipole: 3.4834
quadrupole: -139.2563 -147.9151 -146.4595
quadrupole: 0.6067 8.7000 -3.7842
quadrupole: 5.2874 -3.3715 -1.9159 0.6067 8.7000 -3.7842
hfenergy: -1003.9766448 hartree
pointgroup: C01 [X(C21H34N2O1)]
dipole: 0.3729884 -0.7420576 -1.0901558 debye
polarizability: 284.6859436|-5.1360162|238.2806895|8.3118875|6.9346024|200.1768145 unknown
InChI: InChI=1S/C21H34N2O/c1-4-6-7-11-16-23-17-14-21(15-18-23,20(24)22(3)5-2)19-12-9-8-10-13-19/h8-10,12-13H,4-7,11,14-18H2,1-3H3
charge 0 multiplicity 1
58 atoms
O  2.592462 2.02437 1.210976
N  -1.616592 0.987934 0.300865
N  3.280307 1.503694 -0.927449
C  1.362881 0.169951 0.11673
C  0.390785 0.465125 -1.083458
C  0.523805 0.251923 1.442763
C  -1.076585 0.110463 -0.770473
C  -0.579689 1.326646 1.331211
C  2.030095 -1.223673 0.088562
C  2.463091 1.28819 0.175954
C  -2.885222 0.468664 0.865101
C  -4.04919 0.47443 -0.14938
C  3.135076 -1.472542 0.948215
C  1.53441 -2.300814 -0.691114
C  -5.396645 0.095526 0.505769
C  4.243668 2.634398 -0.857677
C  -6.576477 0.070964 -0.49188
C  3.357543 0.675968 -2.142772
C  3.734537 -2.747989 1.014353
C  2.130409 -3.581782 -0.623214
C  3.234403 -3.812102 0.227451
C  -7.926621 -0.290111 0.169119
C  5.599948 2.220716 -0.248834
C  -9.103076 -0.307583 -0.830609
H  0.424424 1.545757 -1.319732
H  0.70723 -0.066028 -1.998167
H  0.066332 -0.736713 1.637728
H  1.199806 0.490661 2.280779
H  -1.151373 -0.972387 -0.483827
H  -1.683249 0.238493 -1.687198
H  -0.107554 2.298141 1.091594
H  -1.084081 1.449546 2.307344
H  -2.768431 -0.5739 1.27035
H  -3.165246 1.117397 1.717341
H  -4.115101 1.486149 -0.596432
H  -3.840819 -0.231171 -0.978605
H  3.522914 -0.656733 1.570713
H  0.676805 -2.151981 -1.355591
H  -5.30696 -0.900091 0.989777
H  -5.623212 0.816726 1.319173
H  3.787713 3.424581 -0.238888
H  4.377567 3.023403 -1.885071
H  -6.663306 1.062842 -0.9828
H  -6.359932 -0.657851 -1.301194
H  2.813461 1.141181 -2.988426
H  2.958115 -0.332283 -1.966651
H  4.417883 0.563422 -2.435255
H  4.588853 -2.913203 1.68079
H  1.72929 -4.399198 -1.233685
H  3.696782 -4.80415 0.278784
H  -8.1396 0.436717 0.979641
H  -7.838521 -1.282236 0.657581
H  5.457369 1.889964 0.793617
H  6.070142 1.398626 -0.819811
H  6.297719 3.078284 -0.24856
H  -9.230426 0.682095 -1.308814
H  -10.055584 -0.567497 -0.332941
H  -8.929133 -1.04733 -1.635074
