program: Orca
programVersion: 5.0.2
elementType: S P O O O O O N N N C C C C C C C C C C C C C C H H H H H H H H H H H H H H H H H H H H
charge: 0
multiplicity: 1
keywords: wb97x-d3
keywords: def2-TZVPP
keywords: def2/J RIJCOSX
keywords: DEFGRID2
keywords: scfconv7
keywords: smallprint printgap noloewdin
keywords: NOSOSCF
formula: C14H20N3O5PS
InChI: InChI=1/C14H20N3O5PS/c1-5-19-14(18)11-9-17-12(15-10(11)4)8-13(16-17)22-23(24,20-6-2)21-7-3/h8-9H,5-7H2,1-4H3
44 atoms
S  2.789941 0.865481 -2.256957
P  3.133347 0.085855 -0.558456
O  2.29714 -1.287133 -0.194716
O  2.895069 0.974367 0.747897
O  4.598708 -0.487406 -0.377464
O  -4.289018 1.541646 0.135246
O  -5.683273 -0.190091 0.315729
N  -1.013718 -0.69996 0.034577
N  -2.249618 -2.717004 0.185035
N  0.23462 -0.235942 -0.064653
C  -1.075747 -2.086623 0.079488
C  -3.335813 -0.581682 0.17933
C  -2.120324 0.042774 0.07712
C  -3.353391 -2.020853 0.237297
C  0.966005 -1.331381 -0.094415
C  0.228884 -2.520079 -0.007073
C  -4.615501 -2.813653 0.358577
C  -4.565795 0.240669 0.218965
C  2.235836 2.248143 0.715226
C  5.126316 -0.986726 0.860582
C  -5.389089 2.455049 0.161756
C  3.228807 3.369198 0.51636
C  6.086384 0.0106 1.467063
C  -4.828616 3.851357 0.037793
H  -1.981548 1.112072 0.023643
H  0.590214 -3.532467 -0.013468
H  -5.291533 -2.627244 -0.474335
H  -4.356698 -3.868811 0.37991
H  -5.164794 -2.562007 1.26467
H  1.726554 2.332496 1.674996
H  1.477513 2.253124 -0.068163
H  5.638334 -1.916118 0.610419
H  4.328343 -1.235169 1.563694
H  -6.074512 2.231675 -0.658535
H  -5.94593 2.335251 1.093656
H  2.712379 4.328595 0.560409
H  3.711473 3.294751 -0.457308
H  3.996899 3.367305 1.289885
H  5.57462 0.925251 1.761761
H  6.880891 0.267745 0.767825
H  6.547521 -0.418654 2.356703
H  -4.285642 3.98413 -0.897556
H  -5.644888 4.573101 0.053829
H  -4.157814 4.08981 0.862915
totalener: -1825.68864329 hartree
nucrepener: 2477.14141727 hartree
electener: -4302.83006056 hartree
oneelecener: -7430.29095825 hartree
twoeener: 3127.46089769 hartree
kineticenergy: 1819.76380765 hartree
xcener: -138.294917497222 hartree
chargesum: 0.0000000
charge: -0.350010 0.692457 -0.308579 -0.322595 -0.309699 -0.283936 -0.368985 0.150340 -0.286826 -0.378509 0.185384 -0.148055 0.052144 0.147413 0.344784 -0.285048 -0.228131 0.421103 0.034918 0.034285 0.030756 -0.227733 -0.235685 -0.239027 0.149866 0.138524 0.097200 0.103442 0.095907 0.091807 0.089746 0.094074 0.083839 0.091198 0.090272 0.081969 0.087769 0.078772 0.077158 0.091569 0.080811 0.086596 0.085434 0.083279
qa: -0.3500 0.6925 -0.3086 -0.3226 -0.3097 -0.2839 -0.3690 0.1503 -0.2868 -0.3785 0.1854 -0.1481 0.0521 0.1474 0.3448 -0.2850 -0.2281 0.4211 0.0349 0.0343 0.0308 -0.2277 -0.2357 -0.2390 0.1499 0.1385 0.0972 0.1034 0.0959 0.0918 0.0897 0.0941 0.0838 0.0912 0.0903 0.0820 0.0878 0.0788 0.0772 0.0916 0.0808 0.0866 0.0854 0.0833
va: 2.0885 5.5098 2.1731 2.0613 2.1506 2.1074 2.1399 3.4688 3.1427 2.8282 4.0605 3.7286 4.0317 3.9245 4.0561 3.8929 3.9174 4.1657 3.8661 3.8937 3.8693 3.9304 3.9308 3.9533 1.0267 1.0114 1.0071 1.0191 1.0069 0.9939 1.0175 0.9933 1.0012 0.9989 0.9985 1.0134 1.0237 1.0040 1.0129 1.0044 1.0115 1.0042 1.0097 1.0043
dispcorr: -0.020004270 hartree
energy: -1825.708647564848
dipole: -2.84643 2.56895 -0.27747 17.37825 -16.31620 1.06205 11.92676 -10.48671 1.44005
magnitude: 1.81072 au
magnitude: 4.60248 debye
