program: Orca
programVersion: 5.0.2
elementType: S P O O O O O N N N C C C C C C C C C C C C C C H H H H H H H H H H H H H H H H H H H H
charge: 0
multiplicity: 1
keywords: wb97x-d3
keywords: def2-TZVPP
keywords: def2/J RIJCOSX
keywords: DEFGRID2
keywords: scfconv7
keywords: smallprint printgap noloewdin
keywords: NOSOSCF
formula: C14H20N3O5PS
InChI: InChI=1/C14H20N3O5PS/c1-5-19-14(18)11-9-17-12(15-10(11)4)8-13(16-17)22-23(24,20-6-2)21-7-3/h8-9H,5-7H2,1-4H3
44 atoms
S  2.86155 0.49808 -2.06251
P  3.175395 0.083759 -0.225212
O  2.315327 -1.199613 0.344744
O  2.955959 1.212661 0.865645
O  4.61752 -0.420867 0.201473
O  -4.271073 1.605536 -0.138185
O  -5.676529 -0.108033 0.112798
N  -1.001244 -0.615629 0.249021
N  -2.249214 -2.621904 0.443359
N  0.252022 -0.15577 0.220497
C  -1.069772 -1.995601 0.390791
C  -3.327134 -0.498539 0.186436
C  -2.106387 0.122461 0.141457
C  -3.352469 -1.929338 0.349922
C  0.981468 -1.248236 0.330534
C  0.236686 -2.429242 0.443039
C  -4.621306 -2.718185 0.41817
C  -4.554452 0.317638 0.055868
C  2.221969 2.42084 0.618588
C  5.390972 -1.27573 -0.653335
C  -5.370985 2.505392 -0.299277
C  1.450742 2.774904 1.865827
C  6.458227 -0.482002 -1.367726
C  -4.803784 3.876941 -0.575633
H  -1.963271 1.185616 0.020033
H  0.594718 -3.437801 0.543751
H  -5.246424 -2.406279 1.253568
H  -5.222831 -2.594286 -0.481011
H  -4.366176 -3.767942 0.535375
H  1.550049 2.289148 -0.229651
H  2.94051 3.200933 0.3607
H  4.75007 -1.787489 -1.375494
H  5.826183 -2.033028 -0.001413
H  -6.005957 2.170246 -1.122084
H  -5.983364 2.506076 0.605328
H  0.722671 2.000232 2.100131
H  0.915377 3.711515 1.709062
H  2.108916 2.906154 2.723681
H  7.077024 -1.151768 -1.965417
H  7.106142 0.035843 -0.661304
H  6.011163 0.252125 -2.036649
H  -4.18405 4.229454 0.248424
H  -4.205931 3.886921 -1.486504
H  -5.619647 4.587423 -0.705658
totalener: -1825.69039530 hartree
nucrepener: 2480.91132384 hartree
electener: -4306.60171915 hartree
oneelecener: -7437.85067712 hartree
twoeener: 3131.24895797 hartree
kineticenergy: 1819.77883202 hartree
xcener: -138.297424882985 hartree
chargesum: 0.0000000
charge: -0.389433 0.717495 -0.302733 -0.314259 -0.312270 -0.284080 -0.369168 0.156159 -0.287160 -0.393524 0.184509 -0.148302 0.049971 0.148958 0.347020 -0.279812 -0.228063 0.421188 0.043179 0.020386 0.030939 -0.239131 -0.220950 -0.238214 0.150605 0.138378 0.096677 0.096426 0.103610 0.090988 0.105812 0.081493 0.093802 0.090387 0.091004 0.080788 0.074704 0.090637 0.078765 0.085658 0.083041 0.083115 0.086192 0.085212
qa: -0.3894 0.7175 -0.3027 -0.3143 -0.3123 -0.2841 -0.3692 0.1562 -0.2872 -0.3935 0.1845 -0.1483 0.0500 0.1490 0.3470 -0.2798 -0.2281 0.4212 0.0432 0.0204 0.0309 -0.2391 -0.2210 -0.2382 0.1506 0.1384 0.0967 0.0964 0.1036 0.0910 0.1058 0.0815 0.0938 0.0904 0.0910 0.0808 0.0747 0.0906 0.0788 0.0857 0.0830 0.0831 0.0862 0.0852
va: 2.0308 5.5199 2.1848 2.1301 2.1447 2.1079 2.1393 3.4576 3.1428 2.8217 4.0616 3.7350 4.0287 3.9241 4.0559 3.8993 3.9178 4.1645 3.8256 3.9086 3.8688 3.9384 3.9157 3.9531 1.0258 1.0116 1.0070 1.0070 1.0191 1.0188 0.9984 1.0099 0.9949 0.9995 0.9981 1.0147 1.0080 1.0068 1.0112 1.0050 1.0241 1.0046 1.0043 1.0096
dispcorr: -0.019733987 hartree
energy: -1825.710129289376
dipole: -5.65637 5.35501 -0.30136 14.82762 -13.83984 0.98778 1.05010 -0.77542 0.27467
magnitude: 1.06863 au
magnitude: 2.71624 debye
