program: Orca
programVersion: 5.0.2
elementType: S P O O O O O N N N C C C C C C C C C C C C C C H H H H H H H H H H H H H H H H H H H H
charge: 0
multiplicity: 1
keywords: wb97x-d3
keywords: def2-TZVPP
keywords: def2/J RIJCOSX
keywords: DEFGRID2
keywords: scfconv7
keywords: smallprint printgap noloewdin
keywords: NOSOSCF
formula: C14H20N3O5PS
InChI: InChI=1/C14H20N3O5PS/c1-5-19-14(18)11-9-17-12(15-10(11)4)8-13(16-17)22-23(24,20-6-2)21-7-3/h8-9H,5-7H2,1-4H3
44 atoms
S  2.836513 2.091966 0.974369
P  3.253009 0.394555 0.203765
O  2.39291 -0.89537 0.727619
O  4.71354 -0.175487 0.482522
O  3.119353 0.210736 -1.366075
O  -4.183396 1.224336 -1.205535
O  -5.560648 -0.403658 -0.537588
N  -0.914799 -0.564472 0.162558
N  -2.160177 -2.279488 1.223468
N  0.333425 -0.127753 -0.02032
C  -0.983185 -1.706246 0.949538
C  -3.232857 -0.563819 -0.060152
C  -2.015846 0.005255 -0.328477
C  -3.258041 -1.756455 0.747849
C  1.059495 -0.988431 0.66012
C  0.319163 -1.998537 1.290912
C  -4.524995 -2.467943 1.103406
C  -4.455126 0.062024 -0.611411
C  5.479193 0.202854 1.632832
C  3.095548 1.311648 -2.284276
C  -5.263904 1.935063 -1.818444
C  4.95206 -0.398466 2.915997
C  1.678603 1.672186 -2.661067
C  -5.57674 1.415829 -3.205017
H  -1.868709 0.896791 -0.91914
H  0.676074 -2.812324 1.895813
H  -5.224566 -1.815531 1.623929
H  -5.043114 -2.832467 0.217651
H  -4.278082 -3.310236 1.744057
H  5.511716 1.292398 1.70478
H  6.486804 -0.153175 1.421576
H  3.664732 0.978564 -3.152188
H  3.609532 2.175722 -1.857229
H  -6.147444 1.899463 -1.17976
H  -4.920137 2.967894 -1.862767
H  3.975183 0.008178 3.176171
H  5.635094 -0.160098 3.73186
H  4.872898 -1.482729 2.847227
H  1.694591 2.452205 -3.423281
H  1.130128 2.043055 -1.797393
H  1.146027 0.811705 -3.064273
H  -5.958475 0.396708 -3.178464
H  -6.34203 2.044339 -3.661679
H  -4.697382 1.444419 -3.848146
totalener: -1825.68882640 hartree
nucrepener: 2489.44612194 hartree
electener: -4315.13494834 hartree
oneelecener: -7455.14196330 hartree
twoeener: 3140.00701496 hartree
kineticenergy: 1819.77214082 hartree
xcener: -138.298279019560 hartree
chargesum: -0.0000000
charge: -0.387348 0.716014 -0.299479 -0.314738 -0.312562 -0.285208 -0.377030 0.157548 -0.286666 -0.373135 0.182842 -0.157877 0.053939 0.144919 0.343861 -0.284554 -0.230400 0.434912 0.012932 0.025578 0.029551 -0.231480 -0.226456 -0.250270 0.151708 0.138054 0.095510 0.097469 0.103208 0.090639 0.094186 0.094920 0.079328 0.090174 0.098132 0.086177 0.083285 0.089108 0.087795 0.085022 0.082509 0.100528 0.084825 0.082529
qa: -0.3873 0.7160 -0.2995 -0.3147 -0.3126 -0.2852 -0.3770 0.1575 -0.2867 -0.3731 0.1828 -0.1579 0.0539 0.1449 0.3439 -0.2846 -0.2304 0.4349 0.0129 0.0256 0.0296 -0.2315 -0.2265 -0.2503 0.1517 0.1381 0.0955 0.0975 0.1032 0.0906 0.0942 0.0949 0.0793 0.0902 0.0981 0.0862 0.0833 0.0891 0.0878 0.0850 0.0825 0.1005 0.0848 0.0825
va: 2.0314 5.5099 2.1973 2.1403 2.1334 2.1114 2.1244 3.4455 3.1429 2.8248 4.0617 3.7339 4.0285 3.9265 4.0492 3.8949 3.9162 4.1616 3.9000 3.9017 3.8638 3.8818 3.8897 3.9154 1.0278 1.0113 1.0069 1.0075 1.0193 1.0132 0.9918 0.9944 1.0159 1.0119 0.9946 1.0224 1.0114 1.0069 1.0123 1.0204 1.0083 1.0114 1.0098 1.0057
dispcorr: -0.020224456 hartree
energy: -1825.709050859238
dipole: -8.79503 8.73823 -0.05681 5.77090 -5.21381 0.55709 -9.05653 8.21859 -0.83794
magnitude: 1.00783 au
magnitude: 2.56169 debye
