program: Orca
programVersion: 5.0.2
elementType: S P O O O O O N N N C C C C C C C C C C C C C C H H H H H H H H H H H H H H H H H H H H
charge: 0
multiplicity: 1
keywords: wb97x-d3
keywords: def2-TZVPP
keywords: def2/J RIJCOSX
keywords: DEFGRID2
keywords: scfconv7
keywords: smallprint printgap noloewdin
keywords: NOSOSCF
formula: C14H20N3O5PS
InChI: InChI=1/C14H20N3O5PS/c1-5-19-14(18)11-9-17-12(15-10(11)4)8-13(16-17)22-23(24,20-6-2)21-7-3/h8-9H,5-7H2,1-4H3
44 atoms
S  2.769014 2.194654 0.708169
P  3.25163 0.41748 0.198075
O  2.395019 -0.80902 0.861001
O  4.705597 -0.075867 0.617181
O  3.194847 0.025907 -1.338322
O  -4.079779 0.699825 -1.834051
O  -5.528335 -0.505314 -0.633349
N  -0.887863 -0.626991 0.115997
N  -2.171578 -2.113624 1.442443
N  0.365536 -0.222026 -0.098744
C  -0.985673 -1.595841 1.105841
C  -3.196232 -0.687168 -0.187518
C  -1.969376 -0.176152 -0.520571
C  -3.252066 -1.69677 0.839021
C  1.065402 -0.929295 0.762079
C  0.302849 -1.805851 1.546323
C  -4.530018 -2.337449 1.2799
C  -4.399291 -0.177644 -0.88236
C  5.399117 0.454232 1.75212
C  3.199488 1.002548 -2.388858
C  -5.142746 1.310884 -2.571645
C  4.836379 -0.039575 3.065622
C  1.79661 1.309013 -2.855931
C  -5.769857 2.468192 -1.82417
H  -1.800671 0.582423 -1.269871
H  0.637597 -2.483199 2.310962
H  -4.297395 -3.080466 2.03792
H  -5.223832 -1.608128 1.695286
H  -5.04765 -2.81988 0.452114
H  5.381115 1.54586 1.712398
H  6.430232 0.127233 1.623472
H  3.796411 0.564123 -3.188448
H  3.700162 1.91554 -2.058913
H  -4.670816 1.657654 -3.490251
H  -5.893042 0.564981 -2.837627
H  3.832258 0.345602 3.241945
H  5.469481 0.307851 3.882562
H  4.80432 -1.127801 3.102389
H  1.841307 1.984141 -3.71145
H  1.220637 1.788095 -2.066689
H  1.275492 0.402899 -3.16216
H  -6.294993 2.135423 -0.93081
H  -5.021402 3.206526 -1.536715
H  -6.494602 2.964578 -2.470288
totalener: -1825.68899380 hartree
nucrepener: 2490.52138491 hartree
electener: -4316.21037871 hartree
oneelecener: -7457.29129208 hartree
twoeener: 3141.08091337 hartree
kineticenergy: 1819.77645032 hartree
xcener: -138.298995152042 hartree
chargesum: 0.0000000
charge: -0.389785 0.717681 -0.299987 -0.314715 -0.311461 -0.285519 -0.376966 0.159914 -0.286912 -0.373782 0.181563 -0.161051 0.054965 0.145233 0.341406 -0.282402 -0.228076 0.437838 0.011645 0.023959 0.029075 -0.229820 -0.225091 -0.251513 0.151439 0.137185 0.103252 0.097000 0.094952 0.090556 0.093935 0.094434 0.080932 0.096732 0.089847 0.085015 0.083739 0.088897 0.088383 0.084913 0.082262 0.102056 0.083659 0.084615
qa: -0.3898 0.7177 -0.3000 -0.3147 -0.3115 -0.2855 -0.3770 0.1599 -0.2869 -0.3738 0.1816 -0.1611 0.0550 0.1452 0.3414 -0.2824 -0.2281 0.4378 0.0116 0.0240 0.0291 -0.2298 -0.2251 -0.2515 0.1514 0.1372 0.1033 0.0970 0.0950 0.0906 0.0939 0.0944 0.0809 0.0967 0.0898 0.0850 0.0837 0.0889 0.0884 0.0849 0.0823 0.1021 0.0837 0.0846
va: 2.0296 5.5096 2.1945 2.1419 2.1332 2.1098 2.1250 3.4437 3.1424 2.8302 4.0641 3.7383 4.0292 3.9270 4.0555 3.8954 3.9163 4.1602 3.9018 3.9017 3.8666 3.8833 3.8859 3.9124 1.0277 1.0114 1.0194 1.0075 1.0071 1.0136 0.9917 0.9947 1.0152 0.9948 1.0110 1.0215 1.0115 1.0068 1.0121 1.0211 1.0088 1.0116 1.0058 1.0098
dispcorr: -0.020254735 hartree
energy: -1825.709248533588
dipole: -9.16699 9.13168 -0.03531 7.69829 -7.26885 0.42943 -6.22427 5.33069 -0.89358
magnitude: 0.99204 au
magnitude: 2.52156 debye
