program: Orca
programVersion: 5.0.2
elementType: S P O O O O O N N N C C C C C C C C C C C C C C H H H H H H H H H H H H H H H H H H H H
charge: 0
multiplicity: 1
keywords: wb97x-d3
keywords: def2-TZVPP
keywords: def2/J RIJCOSX
keywords: DEFGRID2
keywords: scfconv7
keywords: smallprint printgap noloewdin
keywords: NOSOSCF
formula: C14H20N3O5PS
InChI: InChI=1/C14H20N3O5PS/c1-5-19-14(18)11-9-17-12(15-10(11)4)8-13(16-17)22-23(24,20-6-2)21-7-3/h8-9H,5-7H2,1-4H3
44 atoms
S  2.667583 1.963994 1.308519
P  3.063128 0.344058 0.375073
O  2.240337 -0.997943 0.813732
O  4.490791 -0.31543 0.598539
O  2.931789 0.384876 -1.212489
O  -4.293636 1.008648 -1.354791
O  -5.684638 -0.587846 -0.653079
N  -1.050833 -0.711929 0.148917
N  -2.297772 -2.47022 1.134806
N  0.195829 -0.25183 0.016179
C  -1.124072 -1.869893 0.91205
C  -3.359847 -0.751551 -0.152295
C  -2.145649 -0.155117 -0.369126
C  -3.389505 -1.958996 0.6326
C  0.91396 -1.113805 0.705958
C  0.170864 -2.146469 1.292666
C  -4.652792 -2.702825 0.928948
C  -4.574761 -0.133873 -0.728484
C  5.667082 0.50457 0.641169
C  2.223557 1.41021 -1.922128
C  -5.381087 1.715668 -1.957877
C  6.125051 0.709789 2.065589
C  3.170648 2.492895 -2.383889
C  -4.821499 2.972864 -2.579016
H  -1.998888 0.750684 -0.937655
H  0.522185 -2.963136 1.896865
H  -5.144493 -3.040379 0.01786
H  -4.407897 -3.564993 1.543399
H  -5.374178 -2.080851 1.456959
H  5.490189 1.468754 0.156558
H  6.41801 -0.024273 0.054346
H  1.431509 1.823776 -1.297593
H  1.754633 0.905777 -2.766774
H  -5.86122 1.084813 -2.709216
H  -6.132726 1.95178 -1.201552
H  7.05835 1.273704 2.073193
H  6.303265 -0.242467 2.563968
H  5.385011 1.269563 2.635582
H  3.59853 3.024147 -1.533911
H  2.630802 3.219542 -2.991934
H  3.979879 2.085408 -2.989578
H  -4.35609 3.615898 -1.832529
H  -4.083839 2.746943 -3.348572
H  -5.628113 3.536617 -3.046947
totalener: -1825.68984923 hartree
nucrepener: 2471.33617094 hartree
electener: -4297.02602017 hartree
oneelecener: -7418.70190049 hartree
twoeener: 3121.67588032 hartree
kineticenergy: 1819.77367204 hartree
xcener: -138.297229454990 hartree
chargesum: -0.0000000
charge: -0.387548 0.707286 -0.293140 -0.304323 -0.318204 -0.284114 -0.368714 0.151368 -0.286516 -0.383999 0.188068 -0.147333 0.051537 0.148081 0.340998 -0.285218 -0.229348 0.421276 0.028604 0.053272 0.030351 -0.222131 -0.237366 -0.238788 0.149166 0.140660 0.097011 0.103562 0.096401 0.070175 0.094435 0.086434 0.091122 0.091333 0.090751 0.077602 0.087163 0.086162 0.079286 0.081754 0.088130 0.086803 0.082806 0.085143
qa: -0.3875 0.7073 -0.2931 -0.3043 -0.3182 -0.2841 -0.3687 0.1514 -0.2865 -0.3840 0.1881 -0.1473 0.0515 0.1481 0.3410 -0.2852 -0.2293 0.4213 0.0286 0.0533 0.0304 -0.2221 -0.2374 -0.2388 0.1492 0.1407 0.0970 0.1036 0.0964 0.0702 0.0944 0.0864 0.0911 0.0913 0.0908 0.0776 0.0872 0.0862 0.0793 0.0818 0.0881 0.0868 0.0828 0.0851
va: 2.0289 5.5309 2.2271 2.1384 2.1068 2.1071 2.1403 3.4647 3.1428 2.8258 4.0524 3.7312 4.0342 3.9247 4.0582 3.8929 3.9172 4.1649 3.9218 3.8492 3.8693 3.9216 3.9300 3.9535 1.0270 1.0104 1.0071 1.0190 1.0069 1.0048 0.9948 1.0181 0.9941 0.9984 0.9987 1.0107 1.0059 1.0227 1.0213 1.0140 1.0031 1.0042 1.0044 1.0096
dispcorr: -0.019661660 hartree
energy: -1825.709510888964
dipole: -1.27869 1.21735 -0.06134 14.35060 -13.48573 0.86487 -11.67596 10.37837 -1.29758
magnitude: 1.56060 au
magnitude: 3.96673 debye
