program: Orca
programVersion: 5.0.2
elementType: S P O O O O O N N N C C C C C C C C C C C C C C H H H H H H H H H H H H H H H H H H H H
charge: 0
multiplicity: 1
keywords: wb97x-d3
keywords: def2-TZVPP
keywords: def2/J RIJCOSX
keywords: DEFGRID2
keywords: scfconv7
keywords: smallprint printgap noloewdin
keywords: NOSOSCF
formula: C14H20N3O5PS
InChI: InChI=1/C14H20N3O5PS/c1-5-19-14(18)11-9-17-12(15-10(11)4)8-13(16-17)22-23(24,20-6-2)21-7-3/h8-9H,5-7H2,1-4H3
44 atoms
S  2.677838 2.100394 0.797508
P  3.133046 0.35553 0.167329
O  2.309198 -0.899566 0.827759
O  4.609299 -0.159538 0.460633
O  2.985233 0.041835 -1.381951
O  -4.243957 0.959743 -1.420614
O  -5.63306 -0.566865 -0.573784
N  -0.987927 -0.667311 0.163853
N  -2.242617 -2.2688 1.380037
N  0.261203 -0.242872 -0.041952
C  -1.064163 -1.720168 1.065898
C  -3.303651 -0.6965 -0.083427
C  -2.084539 -0.153903 -0.394565
C  -3.335841 -1.801394 0.840249
C  0.979079 -1.020163 0.741533
C  0.233143 -1.964756 1.460044
C  -4.604798 -2.479938 1.249056
C  -4.52233 -0.125659 -0.699041
C  5.367576 0.298521 1.587242
C  2.679839 1.052555 -2.349188
C  -5.336026 1.624517 -2.062359
C  4.864152 -0.25423 2.901741
C  3.911525 1.828646 -2.756281
C  -4.780565 2.830498 -2.781054
H  -1.932912 0.675848 -1.068286
H  0.58331 -2.706448 2.154844
H  -5.122024 -2.915321 0.395501
H  -4.360634 -3.266148 1.958338
H  -5.304074 -1.785238 1.712474
H  5.367016 1.390831 1.604712
H  6.384557 -0.037071 1.388536
H  1.909751 1.71842 -1.955337
H  2.257792 0.511502 -3.195151
H  -5.827634 0.941753 -2.758882
H  -6.077492 1.918938 -1.316467
H  3.878547 0.138041 3.150936
H  5.546109 0.039827 3.70018
H  4.813129 -1.342216 2.884918
H  4.695139 1.167806 -3.12539
H  4.306503 2.408038 -1.921918
H  3.65684 2.528125 -3.553193
H  -4.056418 2.546182 -3.544036
H  -5.592267 3.363693 -3.275362
H  -4.299975 3.522735 -2.090182
totalener: -1825.69002023 hartree
nucrepener: 2478.12486679 hartree
electener: -4303.81488702 hartree
oneelecener: -7432.46798874 hartree
twoeener: 3128.65310172 hartree
kineticenergy: 1819.77039311 hartree
xcener: -138.296658256595 hartree
chargesum: 0.0000000
charge: -0.387224 0.725463 -0.303717 -0.313709 -0.320497 -0.283172 -0.369777 0.152584 -0.286999 -0.374524 0.187001 -0.144573 0.048931 0.147174 0.344368 -0.286410 -0.229273 0.420351 0.014975 0.033031 0.030776 -0.232069 -0.227407 -0.237455 0.150778 0.137033 0.097390 0.102966 0.095537 0.090038 0.094395 0.088896 0.091818 0.091215 0.089822 0.086329 0.083724 0.089457 0.088288 0.081269 0.079296 0.082701 0.084304 0.086895
qa: -0.3872 0.7255 -0.3037 -0.3137 -0.3205 -0.2832 -0.3698 0.1526 -0.2870 -0.3745 0.1870 -0.1446 0.0489 0.1472 0.3444 -0.2864 -0.2293 0.4204 0.0150 0.0330 0.0308 -0.2321 -0.2274 -0.2375 0.1508 0.1370 0.0974 0.1030 0.0955 0.0900 0.0944 0.0889 0.0918 0.0912 0.0898 0.0863 0.0837 0.0895 0.0883 0.0813 0.0793 0.0827 0.0843 0.0869
va: 2.0319 5.4985 2.1990 2.1377 2.1285 2.1085 2.1388 3.4446 3.1424 2.8021 4.0596 3.7237 4.0356 3.9270 4.0383 3.8954 3.9181 4.1637 3.8976 3.8904 3.8702 3.8852 3.9135 3.9542 1.0271 1.0118 1.0073 1.0193 1.0068 1.0137 0.9917 1.0150 0.9928 0.9982 0.9988 1.0218 1.0114 1.0070 1.0059 1.0240 1.0112 1.0045 1.0094 1.0044
dispcorr: -0.019508596 hartree
energy: -1825.709528828892
dipole: -2.62201 2.62815 0.00614 9.56621 -8.97350 0.59271 -8.21742 7.34913 -0.86829
magnitude: 1.05132 au
magnitude: 2.67223 debye
